{"text_format":"1","workbook":"xlsx","n_sheets":34,"sheets":["START","Instructions","Template names","Lookup and lists","Org structure","Contacts","C1-Sum","C2-FinPerf SC","C2C","C3-FinPerf V","C3C","C4-FinPerf RE","C5-Capex","C5C","C6-FinPos","C7-CFlow","SC1","SC2","SC3","SC4","SC5","SC6","SC7","SC8","SC9","SC10","SC11","SC12","SC13a","SC13b","SC13c","SC13d","SC13e","SC71charts"],"not_rendered":{"charts":5,"images":17,"macros":1,"external_links":0,"defined_names":224,"comments":0,"pivot_tables":0},"unopened":[],"bounds":{"document_bytes":16777216,"sheet_cells":100000,"rows_first":2000,"rows_last":500,"rows_between":2000,"halvings":0,"cell_chars":16384,"cell_head_chars":4096},"cells_cut":0,"cells_raw":0,"read":"whole","date_system":"1900"}

{"sheet":"START","index":0,"n_rows":1,"n_cols":1,"rows_kept":1,"cut":false,"hidden":false,"merged":[]}
[{"$f":"muni","v":{"$error":"#REF!"}}]

{"sheet":"Instructions","index":1,"n_rows":55,"n_cols":25,"rows_kept":55,"cut":false,"hidden":false,"merged":[]}
[null,null,null,null,null,null,{"$f":"'Lookup and lists'!$B$26","v":141},{"$f":"INDEX('Lookup and lists'!$B$28:$B$285,G1)","v":"LIM353 Molemole"}]
[null,null,null,2020]
[]
[null,null,null,null,null,null,null,null,null,null,null,null,null,null,null,null,null,null,null,null,null,null,null,"Yes"]
[null,null,null,null,null,null,null,null,null,null,null,null,null,null,null,null,null,null,null,null,null,null,null,"No"]
[]
[null,null,null,null,null,null,null,null,null,null,null,null,null,null,null,null,null,null,null,null,null,null,"Type of Entities Range:","Parent Municipality"]
[null,null,null,null,null,null,null,null,null,null,null,null,null,null,null,null,null,null,null,null,null,null,null,"Consolidated Information"]
[]
[null,null,null,null,null,null,null,null,null,null,null,null,null,null,null,null,null,null,null,null,null,null,"Date linked",15]
[null,null,null,null,null,null,null,null,null,null,null,null,null,null,null,null,null,null,null,null,null,null,"Date",{"$f":"VLOOKUP(X10,W39:X55,2)","v":"Q3 Third Quarter"},"2013-08-01"]
[]
[]
[]
[]
[]
[]
[]
[null,null,null,null,null,null,null,null,null,null,null,null,null,null,null,null,null,null,null,null,null,null,"MTREF Range:",2014]
[null,null,null,null,null,null,null,null,null,null,null,null,null,null,null,null,null,null,null,null,null,null,null,2015]
[null,null,null,null,null,null,null,null,null,null,null,null,null,null,null,null,null,null,null,null,null,null,null,2016]
[null,null,null,null,null,null,null,null,null,null,null,null,null,null,null,null,null,null,null,null,null,null,null,2017]
[null,null,null,null,null,null,null,null,null,null,null,null,null,null,null,null,null,null,null,null,null,null,null,2018]
[null,null,null,null,null,null,null,null,null,null,null,null,null,null,null,null,null,null,null,null,null,null,null,2019]
[null,null,null,null,null,null,null,null,null,null,null,null,null,null,null,null,null,null,null,null,null,null,null,2020]
[null,null,null,null,null,null,null,null,null,null,null,null,null,null,null,null,null,null,null,null,null,null,null,2021]
[null,null,null,null,null,null,null,null,null,null,null,null,null,null,null,null,null,null,null,null,null,null,null,2022]
[null,null,null,null,null,null,null,null,null,null,null,null,null,null,null,null,null,null,null,null,null,null,null,2023]
[null,null,null,null,null,null,null,null,null,null,null,null,null,null,null,null,null,null,null,null,null,null,null,2024]
[null,null,null,null,null,null,null,null,null,null,null,null,null,null,null,null,null,null,null,null,null,null,null,2025]
[null,null,null,null,null,null,null,null,null,null,null,null,null,null,null,null,null,null,null,null,null,null,null,2026]
[null,null,null,null,null,null,null,null,null,null,null,null,null,null,null,null,null,null,null,null,null,null,null,2027]
[null,null,null,null,null,null,null,null,null,null,null,null,null,null,null,null,null,null,null,null,null,null,null,2028]
[null,null,null,null,null,null,null,null,null,null,null,null,null,null,null,null,null,null,null,null,null,null,"MTREF Linked:"]
[null,null,null,null,null,null,null,null,null,null,null,null,null,null,null,null,null,null,null,null,null,null,"MTREF:",12]
[null,null,null,null,null,null,null,null,null,null,null,null,null,null,null,null,null,null,null,null,null,null,null,{"$f":"INDEX(X19:X32,X35,1)","v":2025}]
[null,null,null,null,null,null,null,null,null,null,null,null,null,null,null,null,null,null,null,null,null,null,"Fin Year:"]
[null,null,null,null,null,null,null,null,null,null,null,null,null,null,null,null,null,null,null,null,null,null,null,{"$f":"MTREF&\"/\"&RIGHT(MTREF,2)+1","v":"2025/26"}]
[null,null,null,null,null,null,null,null,null,null,null,null,null,null,null,null,null,null,null,null,null,"Date/type of report",1,"M01 July"]
[null,null,null,null,null,null,null,null,null,null,null,null,null,null,null,null,null,null,null,null,null,null,2,"M02 August"]
[null,null,null,null,null,null,null,null,null,null,null,null,null,null,null,null,null,null,null,null,null,null,3,"M03 September"]
[null,null,null,null,null,null,null,null,null,null,null,null,null,null,null,null,null,null,null,null,null,null,4,"M04 October"]
[null,null,null,null,null,null,null,null,null,null,null,null,null,null,null,null,null,null,null,null,null,null,5,"M05 November"]
[null,null,null,null,null,null,null,null,null,null,null,null,null,null,null,null,null,null,null,null,null,null,6,"M06 December"]
[null,null,null,null,null,null,null,null,null,null,null,null,null,null,null,null,null,null,null,null,null,null,7,"M07 January"]
[null,null,null,null,null,null,null,null,null,null,null,null,null,null,null,null,null,null,null,null,null,null,8,"M08 February"]
[null,null,null,null,null,null,null,null,null,null,null,null,null,null,null,null,null,null,null,null,null,null,9,"M09 March"]
[null,null,null,null,null,null,null,null,null,null,null,null,null,null,null,null,null,null,null,null,null,null,10,"M10 April"]
[null,null,null,null,null,null,null,null,null,null,null,null,null,null,null,null,null,null,null,null,null,null,11,"M11 May"]
[null,null,null,null,null,null,null,null,null,null,null,null,null,null,null,null,null,null,null,null,null,null,12,"M12 June"]
[null,null,null,null,null,null,null,null,null,null,null,null,null,null,null,null,null,null,null,null,null,null,13,"Q1 First Quarter"]
[null,null,null,null,null,null,null,null,null,null,null,null,null,null,null,null,null,null,null,null,null,null,14,"Q2 Second Quarter"]
[null,null,null,null,null,null,null,null,null,null,null,null,null,null,null,null,null,null,null,null,null,null,15,"Q3 Third Quarter"]
[null,null,null,null,null,null,null,null,null,null,null,null,null,null,null,null,null,null,null,null,null,null,16,"Q4 Fourth Quarter"]
[null,null,null,null,null,null,null,null,null,null,null,null,null,null,null,null,null,null,null,null,null,null,17,"Mid-Year Assessment"]

{"sheet":"Template names","index":2,"n_rows":107,"n_cols":6,"rows_kept":107,"cut":false,"hidden":true,"merged":[[0,0,0,3],[75,0,75,1],[71,0,71,3]]}
["Common sheet headings"]
["Head1",{"$f":"HLOOKUP(MTREF,Headings,2)","v":"2024/25"},"Prior year -1"]
["Head2",{"$f":"HLOOKUP(MTREF,Headings,5)","v":"Budget Year 2025/26"},"Year of approved budget"]
["Head2A",{"$f":"HLOOKUP(MTREF,Headings,4)","v":"2025/26"},"Approved budget year"]
["Head3",{"$f":"HLOOKUP(MTREF,Headings,3)","v":"2025/26 Medium Term Revenue & Expenditure Framework"},"MTREF header name"]
["Head5","Audited Outcome"]
["Head5A","Outcome"]
["Head5B","Pre-audit outcome"]
["Head6","Original Budget"]
["Head7","Adjusted Budget"]
["Head8","Full Year Forecast"]
["Head9",{"$f":"HLOOKUP(MTREF,Headings,5)","v":"Budget Year 2025/26"},"1st year of MTREF","Year1"]
["Head10",{"$f":"HLOOKUP(MTREF,Headings,6)","v":"Budget Year +1 2026/27"},"2nd year of MTREF","Year2"]
["Head11",{"$f":"HLOOKUP(MTREF,Headings,7)","v":"Budget Year +2 2027/28"},"3rd year of MTREF","Year3"]
["Head12","Forecast 2010/11",null,"Year4"]
["Head13","Forecast 2011/12",null,"Year5"]
["Head14","Forecast 2012/13",null,"Year6"]
["Head15","Forecast 2013/14",null,"Year7"]
["Head16","Forecast 2014/15",null,"Year8"]
["Head17","Forecast 2015/16",null,"Year9"]
["Head18","Forecast 2016/17",null,"Year10"]
["Head19","Forecast 2017/18",null,"Year11"]
["Head20","Forecast 2018/19",null,"Year12"]
["Head21","Forecast 2019/20",null,"Year13"]
["Head22","Forecast 2020/21",null,"Year14"]
["Head23","Forecast 2021/22",null,"Year15"]
["Head24","Description",null,"Desc"]
["Head25","Schedule of funding diligence",null,"fdil"]
["Head26","Vote Description",null,"VDesc"]
["Head27","Ref"]
["Head27a","References"]
["Head28","Surplus/ (Deficit) for the year",null,"Result"]
["Head29","Annual target 2007/08"]
["Head30","Revised target 2007/08"]
["Head31","Quarter ended 30 September"]
["Head32","Quarter ended 31 December"]
["Head33","Quarter ended 31 March"]
["Head34","Quarter ended 30 June"]
["Head35","Variance explanation"]
["Head36","YTD  Actual 31 Dec"]
["Head37","YTD  Budget 31 Dec"]
["Head38","Monthly actual"]
["Head39","YearTD actual"]
["Head40","YearTD budget"]
["Head41","YTD variance"]
["Head42","Surplus/ (Deficit) for the yr/period"]
["Head43",{"$f":"Head3&\" Summary\"","v":"2025/26 Medium Term Revenue & Expenditure Framework Summary"}]
["Head44","1996 Census"]
["Head45","2001 Census"]
["Head46"," - Adjustments Budget - Month YYYY"]
["Head47","Previous target year to complete"]
["Head48","Present value"]
["Head49","Virement"]
["Head50","Other Adjusts."]
["Head51","Accum. Funds"]
["Head52","Multi-year capital"]
["Head53","Unfore. Unavoid."]
["Head54","Prior Adjusted"]
["Head55","Nat. or Prov. Govt"]
["Head56","Total Adjusts."]
["Head57",{"$f":"date","v":"Q3 Third Quarter"}]
["Head58","Parent muni."]
["Head59","Downward adjusts"]
["Head60","Month","Report header part name",{"$f":"date","v":"Q3 Third Quarter"}]
["SFPerf1","Budgeted Financial Performance"]
["SFPerf2","Forecast Financial Performance"]
["SFPos1","Budgeted Financial Position"]
["SFPos2","Forecast Financial Position"]
["Cash1","Budget Cash Flow"]
["Cash2","Forecast Cash Flow"]
["RandM","Expenditure includes repairs & maintenance of R'000"]
["Standard nomenclature"]
["Muni",{"$f":"'Lookup and lists'!B27","v":0}]
["Municipal Entities",2,"Type of report:",1]
[{"$f":"IF((MuniEntities=1)*(MuniType=2),\"YES\",\"NO\")","v":"NO"},"Does this municipality have entities (consolidated budget and entity budgets required)? YES/NO"]
["s71 (Monthly Mayor report) schedules and charts"]
["S71sum",{"$f":"IF(Consolques=\"YES\",E77,F77)","v":"Table C1 Monthly Budget Statement Summary"},null,"Table C1 ",{"$f":"D77&\"Consolidated Monthly Budget Statement Summary\"","v":"Table C1 Consolidated Monthly Budget Statement Summary"},{"$f":"D77&\"Monthly Budget Statement Summary\"","v":"Table C1 Monthly Budget Statement Summary"}]
["S71C","Table C3 Monthly Budget Statement - Financial Performance (revenue and expenditure by municipal vote)",null,"Table C3 ",{"$f":"D78&\"Consolidated Monthly Budget Statement - Financial Performance (revenue and expenditure by municipal vote) \"","v":"Table C3 Consolidated Monthly Budget Statement - Financial Performance (revenue and expenditure by municipal vote) "},{"$f":"D78&\"Monthly Budget Statement - Financial Performance (revenue and expenditure by municipal vote)\"","v":"Table C3 Monthly Budget Statement - Financial Performance (revenue and expenditure by municipal vote)"}]
["S71A",{"$f":"IF(Consolques=\"YES\",E79,F79)","v":"Table C2 Monthly Budget Statement - Financial Performance (functional classification)"},null,"Table C2 ",{"$f":"D79&\"Consolidated Monthly Budget Statement - Financial Performance (functional classification) \"","v":"Table C2 Consolidated Monthly Budget Statement - Financial Performance (functional classification) "},{"$f":"D79&\"Monthly Budget Statement - Financial Performance (functional classification)\"","v":"Table C2 Monthly Budget Statement - Financial Performance (functional classification)"}]
["S71B",{"$f":"IF(Consolques=\"YES\",E80,F80)","v":"Table C4 Monthly Budget Statement - Financial Performance (revenue and expenditure)"},null,"Table C4 ",{"$f":"D80&\"Consolidated Monthly Budget Statement - Financial Performance (revenue and expenditure) \"","v":"Table C4 Consolidated Monthly Budget Statement - Financial Performance (revenue and expenditure) "},{"$f":"D80&\"Monthly Budget Statement - Financial Performance (revenue and expenditure)\"","v":"Table C4 Monthly Budget Statement - Financial Performance (revenue and expenditure)"}]
["S71D",{"$f":"IF(Consolques=\"YES\",E81,F81)","v":"Table C5 Monthly Budget Statement - Capital Expenditure (municipal vote, functional classification and funding)"},null,"Table C5 ",{"$f":"D81&\"Consolidated Monthly Budget Statement - Capital Expenditure (municipal vote, functional classification and funding \"","v":"Table C5 Consolidated Monthly Budget Statement - Capital Expenditure (municipal vote, functional classification and funding "},{"$f":"D81&\"Monthly Budget Statement - Capital Expenditure (municipal vote, functional classification and funding)\"","v":"Table C5 Monthly Budget Statement - Capital Expenditure (municipal vote, functional classification and funding)"}]
["S71E","Table C6 Monthly Budget Statement - Financial Position",null,"Table C6 ",{"$f":"D82&\"Consolidated Monthly Budget Statement - Financial Position \"","v":"Table C6 Consolidated Monthly Budget Statement - Financial Position "},{"$f":"D82&\"Monthly Budget Statement - Financial Position\"","v":"Table C6 Monthly Budget Statement - Financial Position"}]
["S71F","Table C7 Monthly Budget Statement - Cash Flow ",null,"Table C7 ",{"$f":"D83&\"Consolidated Monthly Budget Statement - Cash Flow \"","v":"Table C7 Consolidated Monthly Budget Statement - Cash Flow "},{"$f":"D83&\"Monthly Budget Statement - Cash Flow \"","v":"Table C7 Monthly Budget Statement - Cash Flow "}]
["S71G",{"$f":"D84&\"Material variance explanations \"","v":"Supporting Table SC1 Material variance explanations "},null,"Supporting Table SC1 "]
["S71H",{"$f":"D85&\"Monthly Budget Statement - performance indicators  \"","v":"Supporting Table SC2 Monthly Budget Statement - performance indicators  "},null,"Supporting Table SC2 "]
["S71I",{"$f":"D86&\"Monthly Budget Statement - aged debtors\"","v":"Supporting Table SC3 Monthly Budget Statement - aged debtors"},null,"Supporting Table SC3 "]
["S71J",{"$f":"D87&\"Monthly Budget Statement - aged creditors \"","v":"Supporting Table SC4 Monthly Budget Statement - aged creditors "},null,"Supporting Table SC4 "]
["S71K",{"$f":"D88&\"Monthly Budget Statement - investment portfolio \"","v":"Supporting Table SC5 Monthly Budget Statement - investment portfolio "},null,"Supporting Table SC5 "]
["S71L",{"$f":"D89&\"Monthly Budget Statement - transfers and grant receipts \"","v":"Supporting Table SC6 Monthly Budget Statement - transfers and grant receipts "},null,"Supporting Table SC6 "]
["S71M",{"$f":"D90&\" Monthly Budget Statement - transfers and grant expenditure \"","v":"Supporting Table SC7(1) Monthly Budget Statement - transfers and grant expenditure "},null,"Supporting Table SC7(1)"]
["S71N",{"$f":"D91&\"Monthly Budget Statement - councillor and staff benefits \"","v":"Supporting Table SC8 Monthly Budget Statement - councillor and staff benefits "},null,"Supporting Table SC8 "]
["S71O",{"$f":"D92&\"Monthly Budget Statement - actuals and revised targets for cash receipts\"","v":"Supporting Table SC9 Monthly Budget Statement - actuals and revised targets for cash receipts"},null,"Supporting Table SC9 "]
["S71P",{"$f":"IF(Consolques=\"YES\",E93,F93)","v":"NOT REQUIRED - municipality does not have entities or this is the parent municipality's budget"},null,"Supporting Table SC10 ",{"$f":"D93&\"Monthly Budget Statement  - Parent Municipality Financial Performance (revenue and expenditure) \"","v":"Supporting Table SC10 Monthly Budget Statement  - Parent Municipality Financial Performance (revenue and expenditure) "},"NOT REQUIRED - municipality does not have entities or this is the parent municipality's budget"]
["S71Q","NOT REQUIRED - municipality does not have entities or this is the parent municipality's budget",null,"Supporting Table SC11 ",{"$f":"D94&\"Monthly Budget Statement - summary of municipal entities\"","v":"Supporting Table SC11 Monthly Budget Statement - summary of municipal entities"},"NOT REQUIRED - municipality does not have entities or this is the parent municipality's budget"]
["S71R","Supporting Table SC12 Monthly Budget Statement - capital expenditure trend",null,"Supporting Table SC12 ",{"$f":"D95&\"Consolidated Monthly Budget Statement - capital expenditure trend \"","v":"Supporting Table SC12 Consolidated Monthly Budget Statement - capital expenditure trend "},{"$f":"D95&\"Monthly Budget Statement - capital expenditure trend\"","v":"Supporting Table SC12 Monthly Budget Statement - capital expenditure trend"}]
["S71Sa","Supporting Table SC13a Monthly Budget Statement - capital expenditure on new assets by asset class",null,"Supporting Table SC13a ",{"$f":"D96&\"Consolidated Monthly Budget Statement - capital expenditure on new assets by asset class\"","v":"Supporting Table SC13a Consolidated Monthly Budget Statement - capital expenditure on new assets by asset class"},{"$f":"D96&\"Monthly Budget Statement - capital expenditure on new assets by asset class\"","v":"Supporting Table SC13a Monthly Budget Statement - capital expenditure on new assets by asset class"}]
["S71Sb","Supporting Table SC13b Monthly Budget Statement - capital expenditure on renewal of existing assets by asset class",null,"Supporting Table SC13b ",{"$f":"D97&\"Consolidated Monthly Budget Statement - capital expenditure on renewal of existing assets by asset class\"","v":"Supporting Table SC13b Consolidated Monthly Budget Statement - capital expenditure on renewal of existing assets by asset class"},{"$f":"D97&\"Monthly Budget Statement - capital expenditure on renewal of existing assets by asset class\"","v":"Supporting Table SC13b Monthly Budget Statement - capital expenditure on renewal of existing assets by asset class"}]
["S71Sc","Supporting Table SC13c Monthly Budget Statement - expenditure on repairs and maintenance by asset class",null,"Supporting Table SC13c ",{"$f":"D98&\"Consolidated Monthly Budget Statement - expenditure on repairs and maintenance by asset class\"","v":"Supporting Table SC13c Consolidated Monthly Budget Statement - expenditure on repairs and maintenance by asset class"},{"$f":"D98&\"Monthly Budget Statement - expenditure on repairs and maintenance by asset class\"","v":"Supporting Table SC13c Monthly Budget Statement - expenditure on repairs and maintenance by asset class"}]
["S71Sd","Supporting Table SC13d Monthly Budget Statement - depreciation by asset class",null,"Supporting Table SC13d ",{"$f":"D99&\"Consolidated Monthly Budget Statement - depreciation by asset class\"","v":"Supporting Table SC13d Consolidated Monthly Budget Statement - depreciation by asset class"},{"$f":"D99&\"Monthly Budget Statement - depreciation by asset class\"","v":"Supporting Table SC13d Monthly Budget Statement - depreciation by asset class"}]
["S71Se",{"$f":"IF(Consolques=\"YES\",E100,F100)","v":"Supporting Table SC13e Monthly Budget Statement - capital expenditure on upgrading of existing assets by asset class"},null,"Supporting Table SC13e ",{"$f":"D100&\"Consolidated Monthly Budget Statement - capital expenditure on upgrading of existing assets by asset class\"","v":"Supporting Table SC13e Consolidated Monthly Budget Statement - capital expenditure on upgrading of existing assets by asset class"},{"$f":"D100&\"Monthly Budget Statement - capital expenditure on upgrading of existing assets by asset class\"","v":"Supporting Table SC13e Monthly Budget Statement - capital expenditure on upgrading of existing assets by asset class"}]
[null,"s71 charts listing"]
[null,{"$f":"D102&Head2A&\" Capital Expenditure Monthly Trend: actual v target\"","v":"Chart C1 2025/26 Capital Expenditure Monthly Trend: actual v target"},null,"Chart C1 "]
[null,{"$f":"D103&Head2A&\" Capital Expenditure: YTD actual v YTD target\"","v":"Chart C2 2025/26 Capital Expenditure: YTD actual v YTD target"},null,"Chart C2 "]
[null,{"$f":"D104&\"Aged Consumer Debtors Analysis\"","v":"Chart C3 Aged Consumer Debtors Analysis"},null,"Chart C3 "]
[null,{"$f":"D105&\"Consumer Debtors (total by Debtor Customer Category)\"","v":"Chart C4 Consumer Debtors (total by Debtor Customer Category)"},null,"Chart C4 "]
[null,{"$f":"D106&\"Aged Creditors Analysis\"","v":"Chart C5 Aged Creditors Analysis"},null,"Chart C5 "]
["S71T",{"$f":"D107&\" Monthly Budget Statement - Expenditure against approved rollovers\"","v":"Supporting Table SC7(2) Monthly Budget Statement - Expenditure against approved rollovers"},null,"Supporting Table SC7(2)"]

{"sheet":"Lookup and lists","index":3,"n_rows":307,"n_cols":22,"rows_kept":307,"cut":false,"hidden":true,"merged":[]}
["Description",2013,2014,2015,2016,2017,2018,2019,2020,2021,2022,2023,2024,2025,2026,null,"Grants:","National - opex","Provincial - opex","National - capex","Provincial - capex","YESNO"]
[{"$f":"'Template names'!C2","v":"Prior year -1"},{"$f":"B1-1&\"/\"&RIGHT(B1,2)-0","v":"2012/13"},{"$f":"C1-1&\"/\"&RIGHT(C1,2)-0","v":"2013/14"},{"$f":"D1-1&\"/\"&RIGHT(D1,2)-0","v":"2014/15"},{"$f":"E1-1&\"/\"&RIGHT(E1,2)-0","v":"2015/16"},{"$f":"F1-1&\"/\"&RIGHT(F1,2)-0","v":"2016/17"},"2017/18","2018/19","2019/20","2020/21","2021/22","2022/23","2023/24","2024/25","2025/26",null,null,"Local Government Equitable Share","Health subsidy","Municipal Infrastructure Grant (MIG)","Agriculture","Yes"]
[{"$f":"'Template names'!C5","v":"MTREF header name"},{"$f":"B1&\"/\"&RIGHT(B1,2)+1&\" Medium Term Revenue & Expenditure Framework\"","v":"2013/14 Medium Term Revenue & Expenditure Framework"},{"$f":"C1&\"/\"&RIGHT(C1,2)+1&\" Medium Term Revenue & Expenditure Framework\"","v":"2014/15 Medium Term Revenue & Expenditure Framework"},{"$f":"D1&\"/\"&RIGHT(D1,2)+1&\" Medium Term Revenue & Expenditure Framework\"","v":"2015/16 Medium Term Revenue & Expenditure Framework"},{"$f":"E1&\"/\"&RIGHT(E1,2)+1&\" Medium Term Revenue & Expenditure Framework\"","v":"2016/17 Medium Term Revenue & Expenditure Framework"},{"$f":"F1&\"/\"&RIGHT(F1,2)+1&\" Medium Term Revenue & Expenditure Framework\"","v":"2017/18 Medium Term Revenue & Expenditure Framework"},"2018/19 Medium Term Revenue & Expenditure Framework","2019/20 Medium Term Revenue & Expenditure Framework","2020/21 Medium Term Revenue & Expenditure Framework","2021/22 Medium Term Revenue & Expenditure Framework","2022/23 Medium Term Revenue & Expenditure Framework","2023/24 Medium Term Revenue & Expenditure Framework","2024/25 Medium Term Revenue & Expenditure Framework","2025/26 Medium Term Revenue & Expenditure Framework","2026/27 Medium Term Revenue & Expenditure Framework",null,null,"RSC Levy Replacement ","Ambulance subsidy","Public Transport and Systems","Education","No"]
[{"$f":"'Template names'!C4","v":"Approved budget year"},{"$f":"B1&\"/\"&RIGHT(B1,2)+1","v":"2013/14"},{"$f":"C1&\"/\"&RIGHT(C1,2)+1","v":"2014/15"},{"$f":"D1&\"/\"&RIGHT(D1,2)+1","v":"2015/16"},{"$f":"E1&\"/\"&RIGHT(E1,2)+1","v":"2016/17"},{"$f":"F1&\"/\"&RIGHT(F1,2)+1","v":"2017/18"},"2018/19","2019/20","2020/21","2021/22","2022/23","2023/24","2024/25","2025/26","2026/27",null,null,"Finance Management ","Housing","Rural Transport Services and Infrastructure","Health"]
[{"$f":"'Template names'!C12","v":"1st year of MTREF"},{"$f":"\"Budget Year \"&B1&\"/\"&RIGHT(B1,2)+1","v":"Budget Year 2013/14"},{"$f":"\"Budget Year \"&C1&\"/\"&RIGHT(C1,2)+1","v":"Budget Year 2014/15"},{"$f":"\"Budget Year \"&D1&\"/\"&RIGHT(D1,2)+1","v":"Budget Year 2015/16"},{"$f":"\"Budget Year \"&E1&\"/\"&RIGHT(E1,2)+1","v":"Budget Year 2016/17"},{"$f":"\"Budget Year \"&F1&\"/\"&RIGHT(F1,2)+1","v":"Budget Year 2017/18"},"Budget Year 2018/19","Budget Year 2019/20","Budget Year 2020/21","Budget Year 2021/22","Budget Year 2022/23","Budget Year 2023/24","Budget Year 2024/25","Budget Year 2025/26","Budget Year 2026/27",null,null,"Municipal Systems Improvement","Sport and Recreation","Regional Bulk Infrastructure","Housing and Local Government "]
[{"$f":"'Template names'!C13","v":"2nd year of MTREF"},{"$f":"\"Budget Year +1 \"&B1+1&\"/\"&RIGHT(B1,2)+2","v":"Budget Year +1 2014/15"},{"$f":"\"Budget Year +1 \"&C1+1&\"/\"&RIGHT(C1,2)+2","v":"Budget Year +1 2015/16"},{"$f":"\"Budget Year +1 \"&D1+1&\"/\"&RIGHT(D1,2)+2","v":"Budget Year +1 2016/17"},{"$f":"\"Budget Year +1 \"&E1+1&\"/\"&RIGHT(E1,2)+2","v":"Budget Year +1 2017/18"},{"$f":"\"Budget Year +1 \"&F1+1&\"/\"&RIGHT(F1,2)+2","v":"Budget Year +1 2018/19"},"Budget Year +1 2019/20","Budget Year +1 2020/21","Budget Year +1 2021/22","Budget Year +1 2022/23","Budget Year +1 2023/24","Budget Year +1 2024/25","Budget Year +1 2025/26","Budget Year +1 2026/27","Budget Year +1 2027/28",null,null,"Water Services Operating Subsidy ",null,"Rural Households Infrastructure ","Other Departments"]
[{"$f":"'Template names'!C14","v":"3rd year of MTREF"},{"$f":"\"Budget Year +2 \"&B1+2&\"/\"&RIGHT(B1,2)+3","v":"Budget Year +2 2015/16"},{"$f":"\"Budget Year +2 \"&C1+2&\"/\"&RIGHT(C1,2)+3","v":"Budget Year +2 2016/17"},{"$f":"\"Budget Year +2 \"&D1+2&\"/\"&RIGHT(D1,2)+3","v":"Budget Year +2 2017/18"},{"$f":"\"Budget Year +2 \"&E1+2&\"/\"&RIGHT(E1,2)+3","v":"Budget Year +2 2018/19"},{"$f":"\"Budget Year +2 \"&F1+2&\"/\"&RIGHT(F1,2)+3","v":"Budget Year +2 2019/20"},"Budget Year +2 2020/21","Budget Year +2 2021/22","Budget Year +2 2022/23","Budget Year +2 2023/24","Budget Year +2 2024/25","Budget Year +2 2025/26","Budget Year +2 2026/27","Budget Year +2 2027/28","Budget Year +2 2028/29",null,null,"Energy Efficiency  and Demand Management",null,"Neighbourhood Development Partnership","Public Works, Roads, Transport "]
["NOTE: This sheet should not be directly amended - select headings from sheet 'S'",null,null,null,null,null,null,null,null,null,null,null,null,null,null,null,null,"Integrated National Electrification Programme",null,"2010 FIFA World Cup Stadiums Development","Sport and Recreation"]
[null,null,null,null,null,null,null,null,null,null,null,null,null,null,null,null,null,"Municipal Drought Relief "]
[null,null,null,null,null,null,null,null,null,null,null,null,null,null,null,null,null,"2010 FIFA World Cup Operating"]
[null,null,null,null,null,null,null,null,null,null,null,null,null,null,null,null,null,"Electricity Demand Side Management"]
[null,null,null,null,null,null,null,null,null,null,null,null,null,null,null,null,null,"EPWP Incentive"]
[]
[]
[]
[]
[]
[]
[]
[]
[]
[]
[]
[]
[]
["Name link",141]
["Name of Muni"]
[null,"Choose name from list","Set name on 'Instructions' sheet"]
[null,"BUF Buffalo City","EC EASTERN CAPE"]
[null,"NMA Nelson Mandela Bay","EC EASTERN CAPE"]
[null,"EC101 Dr Beyers Naude","EC EASTERN CAPE"]
[null,"EC102 Blue Crane Route","EC EASTERN CAPE"]
[null,"EC104 Makana","EC EASTERN CAPE"]
[null,"EC105 Ndlambe","EC EASTERN CAPE"]
[null,"EC106 Sundays River Valley","EC EASTERN CAPE"]
[null,"EC108 Kouga","EC EASTERN CAPE"]
[null,"EC109 Kou-Kamma","EC EASTERN CAPE"]
[null,"DC10 Sarah Baartman","EC EASTERN CAPE"]
[null,"EC121 Mbhashe","EC EASTERN CAPE"]
[null,"EC122 Mnquma","EC EASTERN CAPE"]
[null,"EC123 Great Kei","EC EASTERN CAPE"]
[null,"EC124 Amahlathi","EC EASTERN CAPE"]
[null,"EC126 Ngqushwa","EC EASTERN CAPE"]
[null,"EC129 Raymond Mhlaba","EC EASTERN CAPE"]
[null,"DC12 Amathole","EC EASTERN CAPE"]
[null,"EC131 Inxuba Yethemba","EC EASTERN CAPE"]
[null,"EC135 Intsika Yethu","EC EASTERN CAPE"]
[null,"EC136 Emalahleni (Ec)","EC EASTERN CAPE"]
[null,"EC137 Engcobo","EC EASTERN CAPE"]
[null,"EC138 Sakhisizwe","EC EASTERN CAPE"]
[null,"EC139 Enoch Mgijima","EC EASTERN CAPE"]
[null,"DC13 Chris Hani","EC EASTERN CAPE"]
[null,"EC141 Elundini","EC EASTERN CAPE"]
[null,"EC142 Senqu","EC EASTERN CAPE"]
[null,"EC145 Walter Sisulu","EC EASTERN CAPE"]
[null,"DC14 Joe Gqabi","EC EASTERN CAPE"]
[null,"EC153 Ngquza Hills","EC EASTERN CAPE"]
[null,"EC154 Port St Johns","EC EASTERN CAPE"]
[null,"EC155 Nyandeni","EC EASTERN CAPE"]
[null,"EC156 Mhlontlo","EC EASTERN CAPE"]
[null,"EC157 King Sabata Dalindyebo","EC EASTERN CAPE"]
[null,"DC15 O .R. Tambo","EC EASTERN CAPE"]
[null,"EC441 Matatiele","EC EASTERN CAPE"]
[null,"EC442 Umzimvubu","EC EASTERN CAPE"]
[null,"EC443 Winnie Madikizela Mandela","EC EASTERN CAPE"]
[null,"EC444 Ntabankulu","EC EASTERN CAPE"]
[null,"DC44 Alfred Nzo","EC EASTERN CAPE"]
[null,"MAN Mangaung","FS FREE STATE"]
[null,"FS161 Letsemeng","FS FREE STATE"]
[null,"FS162 Kopanong","FS FREE STATE"]
[null,"FS163 Mohokare","FS FREE STATE"]
[null,"DC16 Xhariep","FS FREE STATE"]
[null,"FS181 Masilonyana","FS FREE STATE"]
[null,"FS182 Tokologo","FS FREE STATE"]
[null,"FS183 Tswelopele","FS FREE STATE"]
[null,"FS184 Matjhabeng","FS FREE STATE"]
[null,"FS185 Nala","FS FREE STATE"]
[null,"DC18 Lejweleputswa","FS FREE STATE"]
[null,"FS191 Setsoto","FS FREE STATE"]
[null,"FS192 Dihlabeng","FS FREE STATE"]
[null,"FS193 Nketoana","FS FREE STATE"]
[null,"FS194 Maluti-a-Phofung","FS FREE STATE"]
[null,"FS195 Phumelela","FS FREE STATE"]
[null,"FS196 Mantsopa","FS FREE STATE"]
[null,"DC19 Thabo Mofutsanyana","FS FREE STATE"]
[null,"FS201 Moqhaka","FS FREE STATE"]
[null,"FS203 Ngwathe","FS FREE STATE"]
[null,"FS204 Metsimaholo","FS FREE STATE"]
[null,"FS205 Mafube","FS FREE STATE"]
[null,"DC20 Fezile Dabi","FS FREE STATE"]
[null,"EKU City of Ekurhuleni","GT GAUTENG"]
[null,"JHB City Of Johannesburg","GT GAUTENG"]
[null,"TSH City Of Tshwane","GT GAUTENG"]
[null,"GT421 Emfuleni","GT GAUTENG"]
[null,"GT422 Midvaal","GT GAUTENG"]
[null,"GT423 Lesedi","GT GAUTENG"]
[null,"DC42 Sedibeng","GT GAUTENG"]
[null,"GT481 Mogale City","GT GAUTENG"]
[null,"GT484 Merafong City","GT GAUTENG"]
[null,"GT485 Rand West City","GT GAUTENG"]
[null,"DC48 West Rand","GT GAUTENG"]
[null,"ETH eThekwini","KZN KWAZULU-NATAL"]
[null,"KZN212 Umdoni","KZN KWAZULU-NATAL"]
[null,"KZN213 Umzumbe","KZN KWAZULU-NATAL"]
[null,"KZN214 uMuziwabantu","KZN KWAZULU-NATAL"]
[null,"KZN216 Ray Nkonyeni","KZN KWAZULU-NATAL"]
[null,"DC21 Ugu","KZN KWAZULU-NATAL"]
[null,"KZN221 uMshwathi","KZN KWAZULU-NATAL"]
[null,"KZN222 uMngeni","KZN KWAZULU-NATAL"]
[null,"KZN223 Mpofana","KZN KWAZULU-NATAL"]
[null,"KZN224 Impendle","KZN KWAZULU-NATAL"]
[null,"KZN225 Msunduzi","KZN KWAZULU-NATAL"]
[null,"KZN226 Mkhambathini","KZN KWAZULU-NATAL"]
[null,"KZN227 Richmond","KZN KWAZULU-NATAL"]
[null,"DC22 uMgungundlovu","KZN KWAZULU-NATAL"]
[null,"KZN235 Okhahlamba","KZN KWAZULU-NATAL"]
[null,"KZN237 Inkosi Langalibalele","KZN KWAZULU-NATAL"]
[null,"KZN238 Alfred Duma","KZN KWAZULU-NATAL"]
[null,"DC23 Uthukela","KZN KWAZULU-NATAL"]
[null,"KZN241 Endumeni","KZN KWAZULU-NATAL"]
[null,"KZN242 Nquthu","KZN KWAZULU-NATAL"]
[null,"KZN244 Msinga","KZN KWAZULU-NATAL"]
[null,"KZN245 Umvoti","KZN KWAZULU-NATAL"]
[null,"DC24 Umzinyathi","KZN KWAZULU-NATAL"]
[null,"KZN252 Newcastle","KZN KWAZULU-NATAL"]
[null,"KZN253 Emadlangeni","KZN KWAZULU-NATAL"]
[null,"KZN254 Dannhauser","KZN KWAZULU-NATAL"]
[null,"DC25 Amajuba","KZN KWAZULU-NATAL"]
[null,"KZN261 eDumbe","KZN KWAZULU-NATAL"]
[null,"KZN262 uPhongolo","KZN KWAZULU-NATAL"]
[null,"KZN263 Abaqulusi","KZN KWAZULU-NATAL"]
[null,"KZN265 Nongoma","KZN KWAZULU-NATAL"]
[null,"KZN266 Ulundi","KZN KWAZULU-NATAL"]
[null,"DC26 Zululand","KZN KWAZULU-NATAL"]
[null,"KZN271 Umhlabuyalingana","KZN KWAZULU-NATAL"]
[null,"KZN272 Jozini","KZN KWAZULU-NATAL"]
[null,"KZN275 Mtubatuba","KZN KWAZULU-NATAL"]
[null,"KZN276 Hlabisa Big Five","KZN KWAZULU-NATAL"]
[null,"DC27 Umkhanyakude","KZN KWAZULU-NATAL"]
[null,"KZN281 Mfolozi","KZN KWAZULU-NATAL"]
[null,"KZN282 uMhlathuze","KZN KWAZULU-NATAL"]
[null,"KZN284 uMlalazi","KZN KWAZULU-NATAL"]
[null,"KZN285 Mthonjaneni","KZN KWAZULU-NATAL"]
[null,"KZN286 Nkandla","KZN KWAZULU-NATAL"]
[null,"DC28 King Cetshwayo","KZN KWAZULU-NATAL"]
[null,"KZN291 Mandeni","KZN KWAZULU-NATAL"]
[null,"KZN292 KwaDukuza","KZN KWAZULU-NATAL"]
[null,"KZN293 Ndwedwe","KZN KWAZULU-NATAL"]
[null,"KZN294 Maphumulo","KZN KWAZULU-NATAL"]
[null,"DC29 iLembe","KZN KWAZULU-NATAL"]
[null,"KZN433 Greater Kokstad","KZN KWAZULU-NATAL"]
[null,"KZN434 Johannes Phumani Phungula ","KZN KWAZULU-NATAL"]
[null,"KZN435 Umzimkhulu","KZN KWAZULU-NATAL"]
[null,"KZN436 Dr Nkosazana Dlamini Zuma","KZN KWAZULU-NATAL"]
[null,"DC43 Harry Gwala","KZN KWAZULU-NATAL"]
[null,"LIM331 Greater Giyani","LIM LIMPOPO"]
[null,"LIM332 Greater Letaba","LIM LIMPOPO"]
[null,"LIM333 Greater Tzaneen","LIM LIMPOPO"]
[null,"LIM334 Ba-Phalaborwa","LIM LIMPOPO"]
[null,"LIM335 Maruleng","LIM LIMPOPO"]
[null,"DC33 Mopani","LIM LIMPOPO"]
[null,"LIM341 Musina","LIM LIMPOPO"]
[null,"LIM343 Thulamela","LIM LIMPOPO"]
[null,"LIM344 Makhado","LIM LIMPOPO"]
[null,"LIM345 Collins Chabane","LIM LIMPOPO"]
[null,"DC34 Vhembe","LIM LIMPOPO"]
[null,"LIM351 Blouberg","LIM LIMPOPO"]
[null,"LIM353 Molemole","LIM LIMPOPO"]
[null,"LIM354 Polokwane","LIM LIMPOPO"]
[null,"LIM355 Lepelle-Nkumpi","LIM LIMPOPO"]
[null,"DC35 Capricorn","LIM LIMPOPO"]
[null,"LIM361 Thabazimbi","LIM LIMPOPO"]
[null,"LIM362 Lephalale","LIM LIMPOPO"]
[null,"LIM366 Bela Bela","LIM LIMPOPO"]
[null,"LIM367 Mogalakwena","LIM LIMPOPO"]
[null,"LIM368 Modimolle-Mookgopong","LIM LIMPOPO"]
[null,"DC36 Waterberg","LIM LIMPOPO"]
[null,"LIM471 Ephraim Mogale","LIM LIMPOPO"]
[null,"LIM472 Elias Motsoaledi","LIM LIMPOPO"]
[null,"LIM473 Makhuduthamaga","LIM LIMPOPO"]
[null,"LIM476 Tubatse Fetakgomo","LIM LIMPOPO"]
[null,"DC47 Sekhukhune","LIM LIMPOPO"]
[null,"MP301 Albert Luthuli","MP MPUMALANGA"]
[null,"MP302 Msukaligwa","MP MPUMALANGA"]
[null,"MP303 Mkhondo","MP MPUMALANGA"]
[null,"MP304 Pixley Ka Seme (MP)","MP MPUMALANGA"]
[null,"MP305 Lekwa","MP MPUMALANGA"]
[null,"MP306 Dipaleseng","MP MPUMALANGA"]
[null,"MP307 Govan Mbeki","MP MPUMALANGA"]
[null,"DC30 Gert Sibande","MP MPUMALANGA"]
[null,"MP311 Victor Khanye","MP MPUMALANGA"]
[null,"MP312 Emalahleni (Mp)","MP MPUMALANGA"]
[null,"MP313 Steve Tshwete","MP MPUMALANGA"]
[null,"MP314 Emakhazeni","MP MPUMALANGA"]
[null,"MP315 Thembisile Hani","MP MPUMALANGA"]
[null,"MP316 Dr J.S. Moroka","MP MPUMALANGA"]
[null,"DC31 Nkangala","MP MPUMALANGA"]
[null,"MP321 Thaba Chweu","MP MPUMALANGA"]
[null,"MP324 Nkomazi","MP MPUMALANGA"]
[null,"MP325 Bushbuckridge","MP MPUMALANGA"]
[null,"MP326 City of Mbombela","MP MPUMALANGA"]
[null,"DC32 Ehlanzeni","MP MPUMALANGA"]
[null,"NC451 Joe Morolong","NC NORTHERN CAPE"]
[null,"NC452 Ga-Segonyana","NC NORTHERN CAPE"]
[null,"NC453 Gamagara","NC NORTHERN CAPE"]
[null,"DC45 John Taolo Gaetsewe","NC NORTHERN CAPE"]
[null,"NC061 Richtersveld","NC NORTHERN CAPE"]
[null,"NC062 Nama Khoi","NC NORTHERN CAPE"]
[null,"NC064 Kamiesberg","NC NORTHERN CAPE"]
[null,"NC065 Hantam","NC NORTHERN CAPE"]
[null,"NC066 Karoo Hoogland","NC NORTHERN CAPE"]
[null,"NC067 Khai-Ma","NC NORTHERN CAPE"]
[null,"DC6 Namakwa","NC NORTHERN CAPE"]
[null,"NC071 Ubuntu","NC NORTHERN CAPE"]
[null,"NC072 Umsobomvu","NC NORTHERN CAPE"]
[null,"NC073 Emthanjeni","NC NORTHERN CAPE"]
[null,"NC074 Kareeberg","NC NORTHERN CAPE"]
[null,"NC075 Renosterberg","NC NORTHERN CAPE"]
[null,"NC076 Thembelihle","NC NORTHERN CAPE"]
[null,"NC077 Siyathemba","NC NORTHERN CAPE"]
[null,"NC078 Siyancuma","NC NORTHERN CAPE"]
[null,"DC7 Pixley Ka Seme (Nc)","NC NORTHERN CAPE"]
[null,"NC082 !Kai! Garib","NC NORTHERN CAPE"]
[null,"NC084 !Kheis","NC NORTHERN CAPE"]
[null,"NC085 Tsantsabane","NC NORTHERN CAPE"]
[null,"NC086 Kgatelopele","NC NORTHERN CAPE"]
[null,"NC087 Dawid Kruiper","NC NORTHERN CAPE"]
[null,"DC8 Z F Mgcawu","NC NORTHERN CAPE"]
[null,"NC091 Sol Plaatje","NC NORTHERN CAPE"]
[null,"NC092 Dikgatlong","NC NORTHERN CAPE"]
[null,"NC093 Magareng","NC NORTHERN CAPE"]
[null,"NC094 Phokwane","NC NORTHERN CAPE"]
[null,"DC9 Frances Baard","NC NORTHERN CAPE"]
[null,"NW371 Moretele","NW NORTH WEST"]
[null,"NW372 Madibeng","NW NORTH WEST"]
[null,"NW373 Rustenburg","NW NORTH WEST"]
[null,"NW374 Kgetlengrivier","NW NORTH WEST"]
[null,"NW375 Moses Kotane","NW NORTH WEST"]
[null,"DC37 Bojanala Platinum","NW NORTH WEST"]
[null,"NW381 Ratlou","NW NORTH WEST"]
[null,"NW382 Tswaing","NW NORTH WEST"]
[null,"NW383 Mafikeng","NW NORTH WEST"]
[null,"NW384 Ditsobotla","NW NORTH WEST"]
[null,"NW385 Ramotshere Moiloa","NW NORTH WEST"]
[null,"DC38 Ngaka Modiri Molema","NW NORTH WEST"]
[null,"NW392 Naledi (Nw)","NW NORTH WEST"]
[null,"NW393 Mamusa","NW NORTH WEST"]
[null,"NW394 Greater Taung","NW NORTH WEST"]
[null,"NW396 Lekwa-Teemane","NW NORTH WEST"]
[null,"NW397 Kagisano-Molopo","NW NORTH WEST"]
[null,"DC39 Dr Ruth Segomotsi Mompati","NW NORTH WEST"]
[null,"NW403 City Of Matlosana","NW NORTH WEST"]
[null,"NW404 Maquassi Hills","NW NORTH WEST"]
[null,"NW405 J B Marks","NW NORTH WEST"]
[null,"DC40 Dr Kenneth Kaunda","NW NORTH WEST"]
[null,"CPT Cape Town","WC WESTERN CAPE"]
[null,"WC011 Matzikama","WC WESTERN CAPE"]
[null,"WC012 Cederberg","WC WESTERN CAPE"]
[null,"WC013 Bergrivier","WC WESTERN CAPE"]
[null,"WC014 Saldanha Bay","WC WESTERN CAPE"]
[null,"WC015 Swartland","WC WESTERN CAPE"]
[null,"DC1 West Coast","WC WESTERN CAPE"]
[null,"WC022 Witzenberg","WC WESTERN CAPE"]
[null,"WC023 Drakenstein","WC WESTERN CAPE"]
[null,"WC024 Stellenbosch","WC WESTERN CAPE"]
[null,"WC025 Breede Valley","WC WESTERN CAPE"]
[null,"WC026 Langeberg","WC WESTERN CAPE"]
[null,"DC2 Cape Winelands DM","WC WESTERN CAPE"]
[null,"WC031 Theewaterskloof","WC WESTERN CAPE"]
[null,"WC032 Overstrand","WC WESTERN CAPE"]
[null,"WC033 Cape Agulhas","WC WESTERN CAPE"]
[null,"WC034 Swellendam","WC WESTERN CAPE"]
[null,"DC3 Overberg","WC WESTERN CAPE"]
[null,"WC041 Kannaland","WC WESTERN CAPE"]
[null,"WC042 Hessequa","WC WESTERN CAPE"]
[null,"WC043 Mossel Bay","WC WESTERN CAPE"]
[null,"WC044 George","WC WESTERN CAPE"]
[null,"WC045 Oudtshoorn","WC WESTERN CAPE"]
[null,"WC047 Bitou","WC WESTERN CAPE"]
[null,"WC048 Knysna","WC WESTERN CAPE"]
[null,"DC4 Garden Route","WC WESTERN CAPE"]
[null,"WC051 Laingsburg","WC WESTERN CAPE"]
[null,"WC052 Prince Albert","WC WESTERN CAPE"]
[null,"WC053 Beaufort West","WC WESTERN CAPE"]
[null,"DC5 Central Karoo","WC WESTERN CAPE"]
[]
[]
[]
[]
[]
[]
[]
[]
[]
[]
[]
[]
[]
[]
[]
[]
[]
[]
[]
[]
[]
[null,null,{"$f":"COUNTA(C29:C306)","v":257}]

{"sheet":"Org structure","index":4,"n_rows":54,"n_cols":5,"rows_kept":54,"cut":false,"hidden":false,"merged":[]}
["Organisational Structure Votes",null,"Organisational Structure Sub-Votes",null,"Display Sub-Votes"]
[{"$f":"B2&\" - \"&C2","v":"Vote 01 - Corporate Services"},"Vote 01","Corporate Services"]
[{"$f":"B11&\" - \"&C11","v":"Vote 02 - Municipal Manager"},"01.1","Corporate Services Admin",{"$f":"CONCATENATE(B3, \" - \", C3)","v":"01.1 - Corporate Services Admin"},"01.1 - Corporate Services Admin"]
[{"$f":"B17&\" - \"&C17","v":"Vote 03 - Mayors Office"},"01.2","Human Resources","01.2 - Human Resources","01.2 - Human Resources"]
[{"$f":"B23&\" - \"&C23","v":"Vote 04 - Budget And Treasury"},"01.3","Information Technology Services","01.3 - Information Technology Services","01.3 - Information Technology Services"]
[{"$f":"B30&\" - \"&C30","v":"Vote 05 - Community Services"},"01.4","Council Support","01.4 - Council Support","01.4 - Council Support"]
[{"$f":"B37&\" - \"&C37","v":"Vote 06 - Technical Services"},"01.5","Local Economic Development","01.5 - Local Economic Development","01.5 - Local Economic Development"]
[{"$f":"B46&\" - \"&C46","v":"Vote 07 - "},"01.6","Municipal Planning Idp","01.6 - Municipal Planning Idp","01.6 - Municipal Planning Idp"]
["Vote 08 - ","01.7","Town & Regional Planning","01.7 - Town & Regional Planning","01.7 - Town & Regional Planning"]
["Vote 09 - ","01.8","Led Administration","01.8 - Led Administration","01.8 - Led Administration"]
["Vote 10 - ","Vote 02","Municipal Manager"]
["Vote 11 - ","02.1","Municipal Manager Admin",{"$f":"CONCATENATE(B12, \" - \", C12)","v":"02.1 - Municipal Manager Admin"},"02.1 - Municipal Manager Admin"]
["Vote 12 - ","02.2","Legal Services",{"$f":"CONCATENATE(B13, \" - \", C13)","v":"02.2 - Legal Services"},"02.2 - Legal Services"]
["Vote 13 - ","02.3","Political Office Beares",{"$f":"CONCATENATE(B14, \" - \", C14)","v":"02.3 - Political Office Beares"},"02.3 - Political Office Beares"]
["Vote 14 - ","02.4","Pms",{"$f":"CONCATENATE(B15, \" - \", C15)","v":"02.4 - Pms"},"02.4 - Pms"]
["Vote 15 - Other","02.5","Internal Audit",{"$f":"CONCATENATE(B16, \" - \", C16)","v":"02.5 - Internal Audit"},"02.5 - Internal Audit"]
[null,"Vote 03","Mayors Office"]
[null,"03.1","Mayors Office Admin",{"$f":"CONCATENATE(B18, \" - \", C18)","v":"03.1 - Mayors Office Admin"},"03.1 - Mayors Office Admin"]
[null,"03.2","Office Of The Speaker",{"$f":"CONCATENATE(B19, \" - \", C19)","v":"03.2 - Office Of The Speaker"},"03.2 - Office Of The Speaker"]
[null,"03.3","Office Of The Chief Whip",{"$f":"CONCATENATE(B20, \" - \", C20)","v":"03.3 - Office Of The Chief Whip"},"03.3 - Office Of The Chief Whip"]
[null,"03.4","Exco Members",{"$f":"CONCATENATE(B21, \" - \", C21)","v":"03.4 - Exco Members"},"03.4 - Exco Members"]
[null,"03.5","Council General Administration",{"$f":"CONCATENATE(B22, \" - \", C22)","v":"03.5 - Council General Administration"},"03.5 - Council General Administration"]
[null,"Vote 04","Budget And Treasury"]
[null,"04.1","Budget And Treasury Admin",{"$f":"CONCATENATE(B24, \" - \", C24)","v":"04.1 - Budget And Treasury Admin"},"04.1 - Budget And Treasury Admin"]
[null,"04.2","Chief Financial Officer Admin","04.2 - Chief Financial Officer Admin","04.2 - Chief Financial Officer Admin"]
[null,"04.3","Budget & Reporting","04.3 - Budget & Reporting","04.3 - Budget & Reporting"]
[null,"04.4","Revenue Management","04.4 - Revenue Management","04.4 - Revenue Management"]
[null,"04.5","Supply Chain Management","04.5 - Supply Chain Management","04.5 - Supply Chain Management"]
[null,"04.6","Expenditure","04.6 - Expenditure","04.6 - Expenditure"]
[null,"Vote 05","Community Services"]
[null,"05.1","Community Services Admin",{"$f":"CONCATENATE(B31, \" - \", C31)","v":"05.1 - Community Services Admin"},"05.1 - Community Services Admin"]
[null,"05.2","Libraries","05.2 - Libraries","05.2 - Libraries"]
[null,"05.3","Sports Recreation & Social Amenitie","05.3 - Sports Recreation & Social Amenitie","05.3 - Sports Recreation & Social Amenitie"]
[null,"05.4","Traffic Service","05.4 - Traffic Service","05.4 - Traffic Service"]
[null,"05.5","Parks; Cemeteries","05.5 - Parks; Cemeteries","05.5 - Parks; Cemeteries"]
[null,"05.6","Refuse","05.6 - Refuse","05.6 - Refuse"]
[null,"Vote 06","Technical Services"]
[null,"06.1","Mpac",{"$f":"CONCATENATE(B38, \" - \", C38)","v":"06.1 - Mpac"},"06.1 - Mpac"]
[null,"06.2","Technical Services Admin","06.2 - Technical Services Admin","06.2 - Technical Services Admin"]
[null,"06.3","Techn Serv-Roads: Admin","06.3 - Techn Serv-Roads: Admin","06.3 - Techn Serv-Roads: Admin"]
[null,"06.4","Techn Serv-Stormwater: Admin","06.4 - Techn Serv-Stormwater: Admin","06.4 - Techn Serv-Stormwater: Admin"]
[null,"06.5","Project Management Unit","06.5 - Project Management Unit","06.5 - Project Management Unit"]
[null,"06.6","Electrical & Machinery","06.6 - Electrical & Machinery","06.6 - Electrical & Machinery"]
[null,"06.7","Water","06.7 - Water","06.7 - Water"]
[null,"06.8","Sanitation","06.8 - Sanitation","06.8 - Sanitation"]
[null,"Vote 07"]
[null,"Vote 08"]
[null,"Vote 09"]
[null,"Vote 10"]
[null,"Vote 11"]
[null,"Vote 12"]
[null,"Vote 13"]
[null,"Vote 14"]
[null,"Vote 15","Other"]

{"sheet":"Contacts","index":5,"n_rows":140,"n_cols":4,"rows_kept":140,"cut":false,"hidden":false,"merged":[[58,2,58,3],[67,2,67,3],[76,0,76,1],[76,2,76,3],[30,2,30,3],[39,0,39,1],[39,2,39,3],[48,0,48,1],[48,2,48,3],[57,0,57,1],[57,2,57,3],[7,2,7,3],[10,2,10,3],[12,2,12,3],[13,0,13,1],[29,0,29,1],[29,2,29,3],[84,0,84,1],[84,2,84,3],[92,0,92,1],[92,2,92,3],[100,0,100,1],[100,2,100,3],[132,0,132,1],[132,2,132,3],[108,0,108,1],[108,2,108,3],[116,0,116,1],[116,2,116,3],[124,0,124,1],[124,2,124,3]]}
[{"$f":"muni&\" - \"&\" Contact Information\"","v":"LIM353 Molemole -  Contact Information"}]
[]
["A. GENERAL INFORMATION"]
["Municipality",{"$f":"muni","v":"LIM353 Molemole"},"Set name on 'Instructions' sheet"]
[]
["Grade","Level 3","1 Grade in terms of the Remuneration of Public Office Bearers Act."]
[]
["Province",{"$f":"IF(B4>\" \",VLOOKUP(B4,'Lookup and lists'!B28:C311,2, FALSE),\" \")","v":"LIM LIMPOPO"}]
[]
["Web Address","Molemole.gov.za"]
[]
["e-mail Address","info@molemole.gov.za"]
[]
["B. CONTACT INFORMATION"]
["Postal address:"]
["P.O. Box","Private Bag X44"]
["City / Town","Mogwadi"]
["Postal Code","0715"]
[]
["Street address"]
["Building","Civic Center"]
["Street No. & Name","303 Church Street"]
["City / Town","Mogwadi"]
["Postal Code","0715"]
[]
["General Contacts"]
["Telephone number","015 501 2300"]
["Fax number",""]
[]
["C. POLITICAL LEADERSHIP"]
["Speaker:",null,"Secretary/PA to the Speaker:"]
["ID Number","810311 0466 087","ID Number","850930 1072 080"]
["Title","Mrs","Title","Ms"]
["Name","MATLOU DIKELEDI","Name","Maketa Rathete"]
["Telephone number","015 501 0243","Telephone number","015 501 0243"]
["Cell number","060 876 1553","Cell number","072 958 1970"]
["Fax number","015 501 0419","Fax number","015 501 0419"]
["E-mail address","dikeledipakgadi@gmail.com","E-mail address","rathetem@molemole.gov.za"]
[]
["Mayor/Executive Mayor:",null,"Secretary/PA to the Mayor/Executive Mayor:"]
["ID Number","660312 5428 081","ID Number","850930 1072 080"]
["Title","Mr","Title","Ms"]
["Name","PAYA E","Name","RATHETE MAKETA"]
["Telephone number","015 501 0243","Telephone number","015 501 0243"]
["Cell number","082 474 2858","Cell number","072 958 1970"]
["Fax number","086 515 8809","Fax number","015 501 0419"]
["E-mail address","payae@molemole.gov.za","E-mail address","rathetem@molemole.go.za"]
[]
["Deputy Mayor/Executive Mayor:",null,"Secretary/PA to the Deputy Mayor/Executive Mayor:"]
["ID Number",null,"ID Number"]
["Title",null,"Title"]
["Name",null,"Name"]
["Telephone number",null,"Telephone number"]
["Cell number",null,"Cell number"]
["Fax number",null,"Fax number"]
["E-mail address",null,"E-mail address"]
[]
["D. MANAGEMENT LEADERSHIP"]
["Municipal Manager:",null,"Secretary/PA to the Municipal Manager:"]
["ID Number","741022 5373 087","ID Number","7309085465084"]
["Title","Mr","Title","Mr"]
["Name","MAKGATO KGABO EMMANUEL","Name","Nkoto Modisha"]
["Telephone number","015 501 0243","Telephone number","015 501 0243"]
["Cell number","082 619 5734","Cell number","084 563 7813"]
["Fax number","015 501 0419","Fax number","015 501 0419"]
["E-mail address","MakgatoKE@molemole.gov.za","E-mail address","ModishaN@molemole.gov.za"]
[]
["Chief Financial Officer",null,"Secretary/PA to the Chief Financial Officer"]
["ID Number","840119 5370 087","ID Number","9312190190082"]
["Title","Mr","Title","Miss"]
["Name","NKALANGA AS","Name","Rachel Dipela"]
["Telephone number","015 501 0243","Telephone number","015 501 0243"]
["Cell number","072 343 3314","Cell number","071 610 6432"]
["Fax number","015 501 0419","Fax number","015 501 0419"]
["E-mail address","Nkalanga@molemole.gov.za","E-mail address","rdipela@molemole.gov.za"]
[]
["Official responsible for submitting financial information",null,"Official responsible for submitting financial information"]
["ID Number","820214 0303 086","ID Number"]
["Title","Mrs","Title"]
["Name","WISO PORTIA","Name"]
["Telephone number","015 501 0243","Telephone number"]
["Cell number","082 488 3823","Cell number"]
["Fax number","015 501 0419","Fax number"]
["E-mail address","mamabolomp@molemole.gov.za","E-mail address"]
["Official responsible for submitting financial information",null,"Official responsible for submitting financial information"]
["ID Number",null,"ID Number"]
["Title",null,"Title"]
["Name",null,"Name"]
["Telephone number",null,"Telephone number"]
["Cell number",null,"Cell number"]
["Fax number",null,"Fax number"]
["E-mail address",null,"E-mail address"]
["Official responsible for submitting financial information",null,"Official responsible for submitting financial information"]
["ID Number",null,"ID Number"]
["Title",null,"Title"]
["Name",null,"Name"]
["Telephone number",null,"Telephone number"]
["Cell number",null,"Cell number"]
["Fax number",null,"Fax number"]
["E-mail address",null,"E-mail address"]
["Official responsible for submitting financial information",null,"Official responsible for submitting financial information"]
["ID Number",null,"ID Number"]
["Title",null,"Title"]
["Name",null,"Name"]
["Telephone number",null,"Telephone number"]
["Cell number",null,"Cell number"]
["Fax number",null,"Fax number"]
["E-mail address",null,"E-mail address"]
["Official responsible for submitting financial information",null,"Official responsible for submitting financial information"]
["ID Number",null,"ID Number"]
["Title",null,"Title"]
["Name",null,"Name"]
["Telephone number",null,"Telephone number"]
["Cell number",null,"Cell number"]
["Fax number",null,"Fax number"]
["E-mail address",null,"E-mail address"]
["Official responsible for submitting financial information",null,"Official responsible for submitting financial information"]
["ID Number",null,"ID Number"]
["Title",null,"Title"]
["Name",null,"Name"]
["Telephone number",null,"Telephone number"]
["Cell number",null,"Cell number"]
["Fax number",null,"Fax number"]
["E-mail address",null,"E-mail address"]
["Official responsible for submitting financial information",null,"Official responsible for submitting financial information"]
["ID Number",null,"ID Number"]
["Title",null,"Title"]
["Name",null,"Name"]
["Telephone number",null,"Telephone number"]
["Cell number",null,"Cell number"]
["Fax number",null,"Fax number"]
["E-mail address",null,"E-mail address"]
["Official responsible for submitting financial information"]
["ID Number"]
["Title"]
["Name"]
["Telephone number"]
["Cell number"]
["Fax number"]
["E-mail address"]

{"sheet":"C1-Sum","index":6,"n_rows":52,"n_cols":10,"rows_kept":52,"cut":false,"hidden":false,"merged":[[54,0,54,9],[1,0,2,0],[1,2,1,9]]}
[{"$f":"muni& \" - \"&s71sum& \" - \"&date","v":"LIM353 Molemole - Table C1 Monthly Budget Statement Summary - Q3 Third Quarter"}]
[{"$f":"desc","v":"Description"},{"$f":"Head1","v":"2024/25"},{"$f":"Head2","v":"Budget Year 2025/26"}]
[null,{"$f":"Head5","v":"Audited Outcome"},{"$f":"Head6","v":"Original Budget"},{"$f":"Head7","v":"Adjusted Budget"},{"$f":"Head38","v":"Monthly actual"},{"$f":"Head39","v":"YearTD actual"},{"$f":"Head40","v":"YearTD budget"},{"$f":"Head41","v":"YTD variance"},{"$f":"Head41","v":"YTD variance"},{"$f":"Head8","v":"Full Year Forecast"}]
["R thousands",null,null,null,null,null,null,null,"%"]
["Financial Performance"]
["Property rates",{"$f":"SUM('C4-FinPerf RE'!C23)","v":29864220.670000002},{"$f":"SUM('C4-FinPerf RE'!D23)","v":39267857},{"$f":"SUM('C4-FinPerf RE'!E23)","v":39267857},{"$f":"SUM('C4-FinPerf RE'!F23)","v":661872.22},{"$f":"SUM('C4-FinPerf RE'!G23)","v":29540247.329999998},{"$f":"SUM('C4-FinPerf RE'!H23)","v":29450844},{"$f":"F6-G6","v":89403.329999998212},{"$f":"IF(H6=0,\"\",H6/G6)","v":3.0356797244927248E-3},{"$f":"SUM('C4-FinPerf RE'!K23)","v":39267857}]
["Service charges",{"$f":"SUM('C4-FinPerf RE'!C7:C10)","v":13301601.390000001},{"$f":"SUM('C4-FinPerf RE'!D7:D10)","v":15186304},{"$f":"SUM('C4-FinPerf RE'!E7:E10)","v":15186304},{"$f":"SUM('C4-FinPerf RE'!F7:F10)","v":1112616.6000000001},{"$f":"SUM('C4-FinPerf RE'!G7:G10)","v":10241537.25},{"$f":"SUM('C4-FinPerf RE'!H7:H10)","v":11389707},{"$f":"F7-G7","v":-1148169.75},{"$f":"IF(H7=0,\"\",H7/G7)","v":-0.10080766344560049},{"$f":"SUM('C4-FinPerf RE'!K7:K10)","v":15186304}]
["Investment revenue",{"$f":"'C4-FinPerf RE'!C15","v":13918817.93},{"$f":"'C4-FinPerf RE'!D15","v":16695504},{"$f":"'C4-FinPerf RE'!E15","v":16695504},{"$f":"'C4-FinPerf RE'!F15","v":0},{"$f":"'C4-FinPerf RE'!G15","v":6303375.0199999996},{"$f":"'C4-FinPerf RE'!H15","v":12521628},{"$f":"F8-G8","v":-6218252.9800000004},{"$f":"IF(H8=0,\"\",H8/G8)","v":-0.49660099948664826},{"$f":"'C4-FinPerf RE'!K15","v":16695504}]
["Transfers and subsidies - Operational",{"$f":"'C4-FinPerf RE'!C27","v":193141465.66},{"$f":"'C4-FinPerf RE'!D27","v":207339000},{"$f":"'C4-FinPerf RE'!E27","v":191368000},{"$f":"'C4-FinPerf RE'!F27","v":46731000},{"$f":"'C4-FinPerf RE'!G27","v":200773124.77000001},{"$f":"'C4-FinPerf RE'!H27","v":149115832},51657292.770000011,{"$f":"IF(H9=0,\"\",H9/G9)","v":0.34642393149776352},{"$f":"'C4-FinPerf RE'!K27","v":191368000}]
["Other own revenue",{"$f":"+B11-SUM(B6:B9)","v":25252835.150000006},{"$f":"+C11-SUM(C6:C9)","v":18879166},36346938,2797326.9200000018,11984992.359999985,21146412.800000012,{"$f":"F10-G10","v":-9161420.4400000274},{"$f":"IF(H10=0,\"\",H10/G10)","v":-0.43323756736650965},{"$f":"SUM('C4-FinPerf RE'!K34)-SUM('C4-FinPerf RE'!K7:K10)-'C4-FinPerf RE'!K15-'C4-FinPerf RE'!K23-'C4-FinPerf RE'!K27","v":36346938}]
["Total Revenue (excluding capital transfers and contributions)",{"$f":"+'C4-FinPerf RE'!C34","v":275478940.80000001},{"$f":"+'C4-FinPerf RE'!D34","v":297367831},{"$f":"+'C4-FinPerf RE'!E34","v":298864603},{"$f":"+'C4-FinPerf RE'!F34","v":51302815.740000002},{"$f":"+'C4-FinPerf RE'!G34","v":258843276.72999999},{"$f":"+'C4-FinPerf RE'!H34","v":223624423.80000001},{"$f":"F11-G11","v":35218852.929999977},{"$f":"IF(H11=0,\"\",H11/G11)","v":0.1574910840754058},{"$f":"+'C4-FinPerf RE'!K34","v":298864603}]
["Employee costs",{"$f":"'C4-FinPerf RE'!C36","v":118552192.41},{"$f":"'C4-FinPerf RE'!D36","v":121240320},{"$f":"'C4-FinPerf RE'!E36","v":126130876},{"$f":"'C4-FinPerf RE'!F36","v":0},{"$f":"'C4-FinPerf RE'!G36","v":82373611.269999996},{"$f":"'C4-FinPerf RE'!H36","v":92888208.400000006},-10514597.13000001,-0.11319625290565954,{"$f":"'C4-FinPerf RE'!K36","v":126130876}]
["Remuneration of Councillors",{"$f":"'C4-FinPerf RE'!C37","v":14185585.140000001},{"$f":"'C4-FinPerf RE'!D37","v":16413901},{"$f":"'C4-FinPerf RE'!E37","v":16265796},{"$f":"'C4-FinPerf RE'!F37","v":0},{"$f":"'C4-FinPerf RE'!G37","v":9476685.8399999999},{"$f":"'C4-FinPerf RE'!H37","v":12251273},-2774587.16,-0.22647337627689793,{"$f":"'C4-FinPerf RE'!K37","v":16265796}]
["Depreciation and amortisation",{"$f":"'C4-FinPerf RE'!C41","v":24411644.82},{"$f":"'C4-FinPerf RE'!D41","v":21656256},{"$f":"'C4-FinPerf RE'!E41","v":24133195},{"$f":"'C4-FinPerf RE'!F41","v":0},{"$f":"'C4-FinPerf RE'!G41","v":23709323.530000001},{"$f":"'C4-FinPerf RE'!H41","v":17233282.600000001},6476040.9299999997,0.37578684690054343,{"$f":"'C4-FinPerf RE'!K41","v":24133195}]
["Interest",{"$f":"'C4-FinPerf RE'!C42","v":2935813.16},{"$f":"'C4-FinPerf RE'!D42","v":2551065},{"$f":"'C4-FinPerf RE'!E42","v":3085365},{"$f":"'C4-FinPerf RE'!F42","v":0},{"$f":"'C4-FinPerf RE'!G42","v":8689.52},{"$f":"'C4-FinPerf RE'!H42","v":2127030},-2118340.48,-0.99591471676469068,{"$f":"'C4-FinPerf RE'!K42","v":3085365}]
["Inventory consumed and bulk purchases",{"$f":"SUM('C4-FinPerf RE'!C38+'C4-FinPerf RE'!C39)","v":21253995.649999999},{"$f":"SUM('C4-FinPerf RE'!D38+'C4-FinPerf RE'!D39)","v":21593424},{"$f":"SUM('C4-FinPerf RE'!E38+'C4-FinPerf RE'!E39)","v":21282619},{"$f":"SUM('C4-FinPerf RE'!F38+'C4-FinPerf RE'!F39)","v":1499141.47},{"$f":"SUM('C4-FinPerf RE'!G38+'C4-FinPerf RE'!G39)","v":14867936.9},{"$f":"SUM('C4-FinPerf RE'!H38+'C4-FinPerf RE'!H39)","v":16070782},-1202845.0999999996,-7.4846706277267624E-2,{"$f":"SUM('C4-FinPerf RE'!K38+'C4-FinPerf RE'!K39)","v":21282619}]
["Transfers and subsidies",{"$f":"'C4-FinPerf RE'!C44","v":0},{"$f":"'C4-FinPerf RE'!D44","v":0},{"$f":"'C4-FinPerf RE'!E44","v":0},{"$f":"'C4-FinPerf RE'!F44","v":0},{"$f":"'C4-FinPerf RE'!G44","v":0},{"$f":"'C4-FinPerf RE'!H44","v":0},0,"",{"$f":"'C4-FinPerf RE'!K44","v":0}]
["Other expenditure",{"$f":"'C4-FinPerf RE'!C49-SUM('C1-Sum'!B12:B17)","v":127654983.75999999},{"$f":"'C4-FinPerf RE'!D49-SUM('C1-Sum'!C12:C17)","v":101856078},{"$f":"'C4-FinPerf RE'!E49-SUM('C1-Sum'!D12:D17)","v":102605138},{"$f":"'C4-FinPerf RE'!F49-SUM('C1-Sum'!E12:E17)","v":-9934212.1699999999},{"$f":"'C4-FinPerf RE'!G49-SUM('C1-Sum'!F12:F17)","v":48087343.949999988},{"$f":"'C4-FinPerf RE'!H49-SUM('C1-Sum'!G12:G17)","v":76692191.090000004},-28604847.140000015,-0.37298252577542851,{"$f":"'C4-FinPerf RE'!K49-SUM('C1-Sum'!J12:J17)","v":102605138}]
["Total Expenditure",{"$f":"SUM(B12:B18)","v":308994214.94},285311044,293502989,-8435070.6999999993,178523591.00999999,217262767.09,-38739176.080000013,-0.17830563698911422,{"$f":"SUM(J12:J18)","v":293502989}]
["Surplus/(Deficit)",{"$f":"B11-B19","v":-33515274.139999986},12056787,5361614,59737886.439999998,80319685.719999999,6361656.7100000083,73958029.00999999,11.625592574610945,{"$f":"J11-J19","v":5361614}]
["Transfers and subsidies - capital (monetary allocations)",{"$f":"'C4-FinPerf RE'!C51","v":37448726.670000002},{"$f":"'C4-FinPerf RE'!D51","v":52088000},{"$f":"'C4-FinPerf RE'!E51","v":52088000},{"$f":"'C4-FinPerf RE'!F51","v":0},{"$f":"'C4-FinPerf RE'!G51","v":23373512.649999999},{"$f":"'C4-FinPerf RE'!H51","v":39065994},-15692481.350000001,-0.40169159269312338,{"$f":"'C4-FinPerf RE'!K51","v":52088000}]
["Transfers and subsidies - capital (in-kind)",{"$f":"'C4-FinPerf RE'!C52","v":0},{"$f":"'C4-FinPerf RE'!D52","v":0},{"$f":"'C4-FinPerf RE'!E52","v":0},{"$f":"'C4-FinPerf RE'!F52","v":0},{"$f":"'C4-FinPerf RE'!G52","v":0},{"$f":"'C4-FinPerf RE'!H52","v":0},0,"",{"$f":"'C4-FinPerf RE'!K52","v":0}]
["Surplus/(Deficit) after capital transfers & contributions",{"$f":"B20+B21+B22","v":3933452.5300000161},64144787,57449614,59737886.439999998,103693198.37,45427650.710000008,58265547.659999996,1.2826009434640206,{"$f":"J20+J21+J22","v":57449614}]
["Share of surplus/ (deficit) of associate",{"$f":"'C4-FinPerf RE'!C60","v":0},{"$f":"'C4-FinPerf RE'!D60","v":0},{"$f":"'C4-FinPerf RE'!E60","v":0},{"$f":"'C4-FinPerf RE'!F60","v":0},{"$f":"'C4-FinPerf RE'!G60","v":0},{"$f":"'C4-FinPerf RE'!H60","v":0},0,"",{"$f":"'C4-FinPerf RE'!K60","v":0}]
["Surplus/ (Deficit) for the year",{"$f":"B23+B24","v":3933452.5300000161},64144787,57449614,59737886.439999998,103693198.37,45427650.710000008,58265547.659999996,1.2826009434640206,{"$f":"J23+J24","v":57449614}]
[]
["Capital expenditure & funds sources"]
["Capital expenditure",{"$f":"'C5-Capex'!C40","v":52822626.789999999},{"$f":"'C5-Capex'!D40","v":64396800},{"$f":"'C5-Capex'!E40","v":58277000},{"$f":"'C5-Capex'!F40","v":14105735.5},{"$f":"'C5-Capex'!G40","v":34816561.32},{"$f":"'C5-Capex'!H40","v":45849725},{"$f":"F28-G28","v":-11033163.68},{"$f":"IF(H28=0,\"\",H28/G28)","v":-0.24063751047579893},{"$f":"'C5-Capex'!K40","v":58277000}]
["Capital transfers recognised",{"$f":"'C5-Capex'!C70","v":32564110.16},{"$f":"'C5-Capex'!D70","v":52088000},{"$f":"'C5-Capex'!E70","v":52388000},{"$f":"'C5-Capex'!F70","v":14128351.5},{"$f":"'C5-Capex'!G70","v":34158751.32},{"$f":"'C5-Capex'!H70","v":39186012},-5027260.68,-0.12829222529712897,{"$f":"'C5-Capex'!K70","v":52388000}]
[]
["Borrowing",{"$f":"'C5-Capex'!C72","v":0},{"$f":"'C5-Capex'!D72","v":0},{"$f":"'C5-Capex'!E72","v":0},{"$f":"'C5-Capex'!F72","v":0},{"$f":"'C5-Capex'!G72","v":0},{"$f":"'C5-Capex'!H72","v":0},0,"",{"$f":"'C5-Capex'!K72","v":0}]
["Internally generated funds",{"$f":"'C5-Capex'!C73","v":20258516.629999999},{"$f":"'C5-Capex'!D73","v":12308800},{"$f":"'C5-Capex'!E73","v":5889000},{"$f":"'C5-Capex'!F73","v":-22616},{"$f":"'C5-Capex'!G73","v":657810},{"$f":"'C5-Capex'!H73","v":6663713},-6005903,-0.90128476421478532,{"$f":"'C5-Capex'!K73","v":5889000}]
["Total sources of capital funds",{"$f":"+B29+B31+B32","v":52822626.789999999},64396800,58277000,14105735.5,34816561.32,45849725,-11033163.68,-0.24063751047579893,{"$f":"+J29+J31+J32","v":58277000}]
[]
["Financial position"]
["Total current assets",{"$f":"'C6-FinPos'!C14","v":94113954.410000011},{"$f":"'C6-FinPos'!D14","v":225037285},{"$f":"'C6-FinPos'!E14","v":161465686},null,{"$f":"'C6-FinPos'!F14","v":92258310.199999973},null,null,null,{"$f":"'C6-FinPos'!G14","v":161465686}]
["Total non current assets",{"$f":"'C6-FinPos'!C26","v":458764390.82000005},{"$f":"'C6-FinPos'!D26","v":485891851},{"$f":"'C6-FinPos'!E26","v":517519713},null,{"$f":"'C6-FinPos'!F26","v":483145775.08999997},null,null,null,{"$f":"'C6-FinPos'!G26","v":517519713}]
["Total current liabilities",{"$f":"'C6-FinPos'!C38","v":-5669761.4900000021},{"$f":"'C6-FinPos'!D38","v":43303833},{"$f":"'C6-FinPos'!E38","v":58202653},null,{"$f":"'C6-FinPos'!F38","v":-77970942.180000007},null,null,null,{"$f":"'C6-FinPos'!G38","v":58202653}]
["Total non current liabilities",{"$f":"'C6-FinPos'!C44","v":59790949.839999996},{"$f":"'C6-FinPos'!D44","v":58128905},{"$f":"'C6-FinPos'!E44","v":68931671},null,{"$f":"'C6-FinPos'!F44","v":59790949.839999996},null,null,null,{"$f":"'C6-FinPos'!G44","v":68931671}]
["Community wealth/Equity",{"$f":"'C6-FinPos'!C51","v":553729670.66999996},{"$f":"'C6-FinPos'!D51","v":609496398},{"$f":"'C6-FinPos'!E51","v":557970588},null,{"$f":"'C6-FinPos'!F51","v":533772150.81},null,null,null,{"$f":"'C6-FinPos'!G51","v":557970588}]
[]
["Cash flows"]
["Net cash from (used) operating",{"$f":"'C7-CFlow'!C18","v":37325835.920000017},{"$f":"'C7-CFlow'!D18","v":53628252},{"$f":"'C7-CFlow'!E18","v":48894773},{"$f":"'C7-CFlow'!F18","v":0},{"$f":"'C7-CFlow'!G18","v":-44353821.380000055},{"$f":"'C7-CFlow'!H18","v":36172214.840000004},{"$f":"G43-F43","v":80526036.220000058},{"$f":"IF(H43=0,\"\",H43/G43)","v":2.226184837621628},{"$f":"'C7-CFlow'!K18","v":48894773}]
["Net cash from (used) investing",{"$f":"'C7-CFlow'!C28","v":-52052584.670000002},{"$f":"'C7-CFlow'!D28","v":-64396800},{"$f":"'C7-CFlow'!E28","v":-58277000},{"$f":"'C7-CFlow'!F28","v":0},{"$f":"'C7-CFlow'!G28","v":-20710825.82},{"$f":"'C7-CFlow'!H28","v":-43707749.939999998},{"$f":"G44-F44","v":-22996924.119999997},{"$f":"IF(H44=0,\"\",H44/G44)","v":0.5261520932001561},{"$f":"'C7-CFlow'!K28","v":-58277000}]
["Net cash from (used) financing",{"$f":"'C7-CFlow'!C37","v":0},{"$f":"'C7-CFlow'!D37","v":0},{"$f":"'C7-CFlow'!E37","v":0},{"$f":"'C7-CFlow'!F37","v":0},{"$f":"'C7-CFlow'!G37","v":0},{"$f":"'C7-CFlow'!H37","v":0},{"$f":"G45-F45","v":0},{"$f":"IF(H45=0,\"\",H45/G45)","v":""},{"$f":"'C7-CFlow'!K37","v":0}]
["Cash/cash equivalents at the month/year end",{"$f":"'C7-CFlow'!C41","v":125614336.33000003},{"$f":"'C7-CFlow'!D41","v":129572538},{"$f":"'C7-CFlow'!E41","v":130958859},{"$f":"'C7-CFlow'!F41","v":67580471.199999928},{"$f":"'C7-CFlow'!G41","v":67580471.199999958},{"$f":"'C7-CFlow'!H41","v":132805550.90000001},{"$f":"G46-F46","v":65225079.700000048},{"$f":"IF(H46=0,\"\",H46/G46)","v":0.49113217977698281},{"$f":"'C7-CFlow'!K41","v":123262891.40000001}]
[]
["Debtors & creditors analysis",{"$f":"'SC3'!C3","v":"0-30 Days"},{"$f":"'SC3'!D3","v":"31-60 Days"},{"$f":"'SC3'!E3","v":"61-90 Days"},{"$f":"'SC3'!F3","v":"91-120 Days"},{"$f":"'SC3'!G3","v":"121-150 Dys"},{"$f":"'SC3'!H3","v":"151-180 Dys"},{"$f":"'SC3'!I3","v":"181 Dys-1 Yr"},{"$f":"'SC3'!J3","v":"Over 1Yr"},"Total"]
[{"$f":"LEFT('SC3'!A4,20)","v":"Debtors Age Analysis"}]
[{"$f":"'SC3'!A14","v":"Total By Income Source"},{"$f":"'SC3'!C14","v":6064230},{"$f":"'SC3'!D14","v":8527872},{"$f":"'SC3'!E14","v":685388},{"$f":"'SC3'!F14","v":154330577},{"$f":"'SC3'!G14","v":0},{"$f":"'SC3'!H14","v":0},{"$f":"'SC3'!I14","v":0},{"$f":"'SC3'!J14","v":0},{"$f":"'SC3'!K14","v":169608067}]
[{"$f":"LEFT('SC4'!A5,22)","v":"Creditors Age Analysis"}]
["Total Creditors",{"$f":"'SC4'!C16","v":25693},{"$f":"'SC4'!D16","v":39987},{"$f":"'SC4'!E16","v":0},{"$f":"'SC4'!F16","v":0},{"$f":"'SC4'!G16","v":0},{"$f":"'SC4'!H16","v":7370},{"$f":"'SC4'!I16","v":0},{"$f":"'SC4'!J16","v":0},{"$f":"'SC4'!K16","v":73050}]

{"sheet":"C2-FinPerf SC","index":7,"n_rows":55,"n_cols":11,"rows_kept":55,"cut":false,"hidden":false,"merged":[[1,1,2,1],[1,0,2,0],[0,0,0,10],[54,0,54,10]]}
[{"$f":"muni& \" - \"&S71A& \" - \"&date","v":"LIM353 Molemole - Table C2 Monthly Budget Statement - Financial Performance (functional classification) - Q3 Third Quarter"}]
[{"$f":"desc","v":"Description"},{"$f":"head27","v":"Ref"},{"$f":"Head1","v":"2024/25"},{"$f":"Head2","v":"Budget Year 2025/26"}]
[null,null,{"$f":"Head5","v":"Audited Outcome"},{"$f":"Head6","v":"Original Budget"},{"$f":"Head7","v":"Adjusted Budget"},{"$f":"Head38","v":"Monthly actual"},{"$f":"Head39","v":"YearTD actual"},{"$f":"Head40","v":"YearTD budget"},{"$f":"Head41","v":"YTD variance"},{"$f":"Head41","v":"YTD variance"},{"$f":"Head8","v":"Full Year Forecast"}]
["R thousands",1,null,null,null,null,null,null,null,"%"]
["Revenue - Functional"]
["Governance and administration",null,{"$f":"SUM(C7:C9)","v":235844658.69},247348598,248174958,49329758.960000001,227618230.05000001,185841919,{"$f":"G6-H6","v":41776311.050000012},{"$f":"IF(I6=0,\"\",I6/H6)","v":0.22479487553074617},{"$f":"SUM(K7:K9)","v":248174958}]
["Executive and council",null,{"$f":"'C2C'!C7","v":6000},{"$f":"'C2C'!D7","v":0},{"$f":"'C2C'!E7","v":0},{"$f":"'C2C'!F7","v":0},{"$f":"'C2C'!G7","v":0},{"$f":"'C2C'!H7","v":0},0,{"$f":"IF(I7=0,\"\",I7/H7)","v":""},{"$f":"'C2C'!K7","v":0}]
["Finance and administration",null,{"$f":"'C2C'!C10","v":235838658.69},{"$f":"'C2C'!D10","v":247348598},{"$f":"'C2C'!E10","v":248114958},{"$f":"'C2C'!F10","v":49329758.960000001},{"$f":"'C2C'!G10","v":227582146.77000001},{"$f":"'C2C'!H10","v":185817919},41764227.770000011,0.22475888221522924,{"$f":"'C2C'!K10","v":248114958}]
["Internal audit",null,{"$f":"'C2C'!C24","v":0},{"$f":"'C2C'!D24","v":0},{"$f":"'C2C'!E24","v":60000},{"$f":"'C2C'!F24","v":0},{"$f":"'C2C'!G24","v":36083.279999999999},{"$f":"'C2C'!H24","v":24000},12083.279999999999,0.50346999999999997,{"$f":"'C2C'!K24","v":60000}]
["Community and public safety",null,{"$f":"SUM(C11:C15)","v":6766968.6100000003},13884801,12479801,869508.83,8622543.370000001,9851576,-1229032.629999999,-0.12475492550633513,{"$f":"SUM(K11:K15)","v":12479801}]
["Community and social services",null,{"$f":"'C2C'!C27","v":1402864},{"$f":"'C2C'!D27","v":1405000},{"$f":"'C2C'!E27","v":0},{"$f":"'C2C'!F27","v":1980},{"$f":"'C2C'!G27","v":5940},{"$f":"'C2C'!H27","v":491747},-485807,-0.98792061771602069,{"$f":"'C2C'!K27","v":0}]
["Sport and recreation",null,{"$f":"'C2C'!C49","v":233209.67},{"$f":"'C2C'!D49","v":332},{"$f":"'C2C'!E49","v":332},{"$f":"'C2C'!F49","v":19345.87},{"$f":"'C2C'!G49","v":328879.75},{"$f":"'C2C'!H49","v":243},328636.75,1352.414609053498,{"$f":"'C2C'!K49","v":332}]
["Public safety",null,{"$f":"'C2C'!C55","v":5130894.9400000004},{"$f":"'C2C'!D55","v":12479469},{"$f":"'C2C'!E55","v":12479469},{"$f":"'C2C'!F55","v":848182.96},{"$f":"'C2C'!G55","v":8287723.6200000001},{"$f":"'C2C'!H55","v":9359586},-1071862.3799999999,-0.11452027685839949,{"$f":"'C2C'!K55","v":12479469}]
["Housing",null,{"$f":"'C2C'!C64","v":0},{"$f":"'C2C'!D64","v":0},{"$f":"'C2C'!E64","v":0},{"$f":"'C2C'!F64","v":0},{"$f":"'C2C'!G64","v":0},{"$f":"'C2C'!H64","v":0},0,"",{"$f":"'C2C'!K64","v":0}]
["Health",null,{"$f":"'C2C'!C67","v":0},{"$f":"'C2C'!D67","v":0},{"$f":"'C2C'!E67","v":0},{"$f":"'C2C'!F67","v":0},{"$f":"'C2C'!G67","v":0},{"$f":"'C2C'!H67","v":0},0,"",{"$f":"'C2C'!K67","v":0}]
["Economic and environmental services",null,{"$f":"SUM(C17:C19)","v":40031927.559999995},56172642,56172642,6911.11,21650235.899999999,42129459,-20479223.100000001,-0.48610220938275045,{"$f":"SUM(K17:K19)","v":56172642}]
["Planning and development",null,{"$f":"'C2C'!C76","v":40031927.559999995},{"$f":"'C2C'!D76","v":56172642},{"$f":"'C2C'!E76","v":56172642},{"$f":"'C2C'!F76","v":6911.11},{"$f":"'C2C'!G76","v":164346.95000000001},{"$f":"'C2C'!H76","v":42129459},-41965112.049999997,-0.99609900165107734,{"$f":"'C2C'!K76","v":56172642}]
["Road transport",null,{"$f":"'C2C'!C87","v":0},{"$f":"'C2C'!D87","v":0},{"$f":"'C2C'!E87","v":0},{"$f":"'C2C'!F87","v":0},{"$f":"'C2C'!G87","v":21485888.949999999},{"$f":"'C2C'!H87","v":0},21485888.949999999,{"$error":"#DIV/0!"},{"$f":"'C2C'!K87","v":0}]
["Environmental protection",null,{"$f":"'C2C'!C92","v":0},{"$f":"'C2C'!D92","v":0},{"$f":"'C2C'!E92","v":0},{"$f":"'C2C'!F92","v":0},{"$f":"'C2C'!G92","v":0},{"$f":"'C2C'!H92","v":0},0,"",{"$f":"'C2C'!K92","v":0}]
["Trading services",null,{"$f":"SUM(C21:C24)","v":31019919.25},{"$f":"SUM(D21:D24)","v":32301514},34952586,1170677.22,24819992.240000002,25286520.800000001,-466528.55999999889,-1.8449693561638534E-2,{"$f":"SUM(K21:K24)","v":34952586}]
["Energy sources",null,{"$f":"'C2C'!C100","v":29076343.920000002},{"$f":"'C2C'!D100","v":30352837},{"$f":"'C2C'!E100","v":31598909},{"$f":"'C2C'!F100","v":1009730.49},{"$f":"'C2C'!G100","v":20526767.920000002},{"$f":"'C2C'!H100","v":23263037.800000001},{"$f":"G21-H21","v":-2736269.879999999},-0.11762306812741365,{"$f":"'C2C'!K100","v":31598909}]
["Water management",null,{"$f":"'C2C'!C104","v":206931.24},{"$f":"'C2C'!D104","v":146962},{"$f":"'C2C'!E104","v":146962},{"$f":"'C2C'!F104","v":0},{"$f":"'C2C'!G104","v":69795.58},{"$f":"'C2C'!H104","v":110214},{"$f":"G22-H22","v":-40418.42},-0.36672673163119024,{"$f":"'C2C'!K104","v":146962}]
["Waste water management",null,{"$f":"'C2C'!C108","v":0},{"$f":"'C2C'!D108","v":365798},{"$f":"'C2C'!E108","v":365798},{"$f":"'C2C'!F108","v":0},{"$f":"'C2C'!G108","v":1886506.05},{"$f":"'C2C'!H108","v":274347},{"$f":"G23-H23","v":1612159.05},5.876350206125819,{"$f":"'C2C'!K108","v":365798}]
["Waste management",null,{"$f":"'C2C'!C113","v":1736644.09},{"$f":"'C2C'!D113","v":1435917},{"$f":"'C2C'!E113","v":2840917},{"$f":"'C2C'!F113","v":160946.73000000001},{"$f":"'C2C'!G113","v":2336922.69},{"$f":"'C2C'!H113","v":1638922},{"$f":"G24-H24","v":698000.69},0.42589012167754164,{"$f":"'C2C'!K113","v":2840917}]
["Other",4,{"$f":"'C2C'!C118","v":0},{"$f":"'C2C'!D118","v":0},{"$f":"'C2C'!E118","v":0},{"$f":"'C2C'!F118","v":0},{"$f":"'C2C'!G118","v":0},{"$f":"'C2C'!H118","v":0},{"$f":"G25-H25","v":0},"",{"$f":"'C2C'!K118","v":0}]
["Total Revenue - Functional",2,{"$f":"C6+C10+C16+C20+C25","v":313663474.11000001},{"$f":"D6+D10+D16+D20+D25","v":349707555},351779987,51376856.119999997,282711001.56,263109474.80000001,19601526.760000017,7.4499509281829995E-2,{"$f":"K6+K10+K16+K20+K25","v":351779987}]
[]
["Expenditure - Functional"]
["Governance and administration",null,{"$f":"SUM(C30:C32)","v":162515402.66999999},145793806,154318370,3224788.33,104885535.62,112791666.57000001,{"$f":"G29-H29","v":-7906130.950000003},{"$f":"IF(I29=0,\"\",I29/H29)","v":-7.0094991859113567E-2},{"$f":"SUM(K30:K32)","v":154318370}]
["Executive and council",null,{"$f":"'C2C'!C129","v":35591736.700000003},{"$f":"'C2C'!D129","v":41625382},{"$f":"'C2C'!E129","v":43815523},{"$f":"'C2C'!F129","v":470988.55},{"$f":"'C2C'!G129","v":24796472.73},{"$f":"'C2C'!H129","v":32188348.370000001},-7391875.6400000006,{"$f":"IF(I30=0,\"\",I30/H30)","v":-0.22964445255256818},{"$f":"'C2C'!K129","v":43815523}]
["Finance and administration",null,{"$f":"'C2C'!C132","v":116176176.68999998},{"$f":"'C2C'!D132","v":91979689},{"$f":"'C2C'!E132","v":97738179},{"$f":"'C2C'!F132","v":2753799.7800000003},{"$f":"'C2C'!G132","v":70562054.989999995},{"$f":"'C2C'!H132","v":71359070.939999998},-797015.95000000298,-1.1169090901844118E-2,{"$f":"'C2C'!K132","v":97738179}]
["Internal audit",null,{"$f":"'C2C'!C146","v":10747489.279999999},{"$f":"'C2C'!D146","v":12188735},{"$f":"'C2C'!E146","v":12764668},{"$f":"'C2C'!F146","v":0},{"$f":"'C2C'!G146","v":9527007.9000000004},{"$f":"'C2C'!H146","v":9244247.2599999998},282760.6400000006,3.0587740899522479E-2,{"$f":"'C2C'!K146","v":12764668}]
["Community and public safety",null,{"$f":"SUM(C34:C38)","v":31625084.519999996},32650607,31979380,39876.92,21215805.939999998,24210924.199999999,-2995118.2600000016,-0.12370937330843412,{"$f":"SUM(K34:K38)","v":31979380}]
["Community and social services",null,{"$f":"'C2C'!C149","v":5908411.3099999996},{"$f":"'C2C'!D149","v":10211046},{"$f":"'C2C'!E149","v":9555834},{"$f":"'C2C'!F149","v":0},{"$f":"'C2C'!G149","v":3970286.63},{"$f":"'C2C'!H149","v":7396474.2000000002},-3426187.5700000003,-0.46321902535670312,{"$f":"'C2C'!K149","v":9555834}]
["Sport and recreation",null,{"$f":"'C2C'!C171","v":3591191.65},{"$f":"'C2C'!D171","v":3484575},{"$f":"'C2C'!E171","v":3628560},{"$f":"'C2C'!F171","v":1814.78},{"$f":"'C2C'!G171","v":1877842.81},{"$f":"'C2C'!H171","v":2662113},-784270.19,-0.29460439508014874,{"$f":"'C2C'!K171","v":3628560}]
["Public safety",null,{"$f":"'C2C'!C177","v":22125481.559999999},{"$f":"'C2C'!D177","v":18954986},{"$f":"'C2C'!E177","v":18794986},{"$f":"'C2C'!F177","v":38062.14},{"$f":"'C2C'!G177","v":15367676.5},{"$f":"'C2C'!H177","v":14152337},1215339.5,8.587553419622497E-2,{"$f":"'C2C'!K177","v":18794986}]
["Housing",null,{"$f":"'C2C'!C186","v":0},{"$f":"'C2C'!D186","v":0},{"$f":"'C2C'!E186","v":0},{"$f":"'C2C'!F186","v":0},{"$f":"'C2C'!G186","v":0},{"$f":"'C2C'!H186","v":0},0,"",{"$f":"'C2C'!K186","v":0}]
["Health",null,{"$f":"'C2C'!C189","v":0},{"$f":"'C2C'!D189","v":0},{"$f":"'C2C'!E189","v":0},{"$f":"'C2C'!F189","v":0},{"$f":"'C2C'!G189","v":0},{"$f":"'C2C'!H189","v":0},0,"",{"$f":"'C2C'!K189","v":0}]
["Economic and environmental services",null,{"$f":"SUM(C40:C42)","v":25412846},24340871,22829717,540356.51,11730711.390000001,17625498.52,-5894787.129999999,-0.33444654761458625,{"$f":"SUM(K40:K42)","v":22829717}]
["Planning and development",null,{"$f":"'C2C'!C198","v":14645203.039999999},{"$f":"'C2C'!D198","v":16980667},{"$f":"'C2C'!E198","v":15629513},{"$f":"'C2C'!F198","v":236740.50999999998},{"$f":"'C2C'!G198","v":7719549.4199999999},{"$f":"'C2C'!H198","v":12160303.52},-4440754.0999999996,-0.36518447855321295,{"$f":"'C2C'!K198","v":15629513}]
["Road transport",null,{"$f":"'C2C'!C209","v":10767642.960000001},{"$f":"'C2C'!D209","v":7360204},{"$f":"'C2C'!E209","v":7200204},{"$f":"'C2C'!F209","v":303616},{"$f":"'C2C'!G209","v":4011161.97},{"$f":"'C2C'!H209","v":5465195},-1454033.0299999998,-0.26605327531771505,{"$f":"'C2C'!K209","v":7200204}]
["Environmental protection",null,{"$f":"'C2C'!C214","v":0},{"$f":"'C2C'!D214","v":0},{"$f":"'C2C'!E214","v":0},{"$f":"'C2C'!F214","v":0},{"$f":"'C2C'!G214","v":0},{"$f":"'C2C'!H214","v":0},0,"",{"$f":"'C2C'!K214","v":0}]
["Trading services",null,{"$f":"SUM(C44:C47)","v":89440881.75},{"$f":"SUM(D44:D47)","v":82525760},84375522,-12240092.460000001,40691538.060000002,62634677.799999997,-21943139.739999998,-0.35033531760260767,{"$f":"SUM(K44:K47)","v":84375522}]
["Energy sources",null,{"$f":"'C2C'!C222","v":48671083.350000001},{"$f":"'C2C'!D222","v":46298999},{"$f":"'C2C'!E222","v":47947380},{"$f":"'C2C'!F222","v":-12331230.15},{"$f":"'C2C'!G222","v":17298831.280000001},{"$f":"'C2C'!H222","v":35383755.399999999},-18084924.119999997,-0.5111081035790791,{"$f":"'C2C'!K222","v":47947380}]
["Water management",null,{"$f":"'C2C'!C226","v":7217372.5499999998},{"$f":"'C2C'!D226","v":6631392},{"$f":"'C2C'!E226","v":7480167},{"$f":"'C2C'!F226","v":0},{"$f":"'C2C'!G226","v":4624871.5199999996},{"$f":"'C2C'!H226","v":5313144},-688272.48000000045,-0.12954146923177698,{"$f":"'C2C'!K226","v":7480167}]
["Waste water management",null,{"$f":"'C2C'!C230","v":23385006.330000002},{"$f":"'C2C'!D230","v":18265366},{"$f":"'C2C'!E230","v":18975477},{"$f":"'C2C'!F230","v":4316.6000000000004},{"$f":"'C2C'!G230","v":10747672.029999999},{"$f":"'C2C'!H230","v":13983196.4},-3235524.370000001,-0.23138660699924096,{"$f":"'C2C'!K230","v":18975477}]
["Waste management",null,{"$f":"'C2C'!C235","v":10167419.52},{"$f":"'C2C'!D235","v":11330003},{"$f":"'C2C'!E235","v":9972498},{"$f":"'C2C'!F235","v":86821.09},{"$f":"'C2C'!G235","v":8020163.2300000004},{"$f":"'C2C'!H235","v":7954582},65581.230000000447,8.2444596083113414E-3,{"$f":"'C2C'!K235","v":9972498}]
["Other",null,{"$f":"'C2C'!C240","v":0},{"$f":"'C2C'!D240","v":0},{"$f":"'C2C'!E240","v":0},{"$f":"'C2C'!F240","v":0},{"$f":"'C2C'!G240","v":0},{"$f":"'C2C'!H240","v":0},0,"",{"$f":"'C2C'!K240","v":0}]
["Total Expenditure - Functional",3,{"$f":"C29+C33+C39+C43+C48","v":308994214.94},{"$f":"D29+D33+D39+D43+D48","v":285311044},293502989,-8435070.7000000011,178523591.00999999,217262767.09000003,-38739176.079999998,-0.17830563698911414,{"$f":"K29+K33+K39+K43+K48","v":293502989}]
["Surplus/ (Deficit) for the year",null,{"$f":"C26-C49","v":4669259.1700000167},64396511,58276998,59811926.82,104187410.55000001,45846707.709999979,{"$f":"I26-I49","v":58340702.840000018},{"$f":"IF(I50=0,\"\",I50/H50)","v":1.2725167357497054},{"$f":"K26-K49","v":58276998}]
[{"$f":"head27a","v":"References"}]
["1. Government Finance Statistics Functions and Sub-functions are standardised to assist the compilation of national and international accounts for comparison purposes"]
["2. Total Revenue by functional classification must reconcile to Total Operating Revenue shown in the Financial Performance Statement"]
["3. Total Expenditure by functional classification must reconcile to total operating expenditure shown in 'Financial Performance Statement'"]
["4. All amounts must be classified under a functional classification (modified GFS). The GFS function 'Other' is only for Abbatoirs, Air Transport, Licensing and Regulation, Markets and Tourism - and if used must be supported by footnotes. Nothing else may be placed under 'Other'. Assign associate share to relevant classification"]

{"sheet":"C2C","index":8,"n_rows":257,"n_cols":11,"rows_kept":257,"cut":false,"hidden":false,"merged":[[252,0,252,10],[0,0,0,10],[1,0,2,0],[1,1,2,1]]}
[{"$f":"muni& \" - \"&S71A& \" - \"&date","v":"LIM353 Molemole - Table C2 Monthly Budget Statement - Financial Performance (functional classification) - Q3 Third Quarter"}]
[{"$f":"desc","v":"Description"},{"$f":"head27","v":"Ref"},{"$f":"Head1","v":"2024/25"},{"$f":"Head2","v":"Budget Year 2025/26"}]
[null,null,{"$f":"Head5","v":"Audited Outcome"},{"$f":"Head6","v":"Original Budget"},{"$f":"Head7","v":"Adjusted Budget"},{"$f":"Head38","v":"Monthly actual"},{"$f":"Head39","v":"YearTD actual"},{"$f":"Head40","v":"YearTD budget"},{"$f":"Head41","v":"YTD variance"},{"$f":"Head41","v":"YTD variance"},{"$f":"Head8","v":"Full Year Forecast"}]
["R thousands",1,null,null,null,null,null,null,null,"%"]
["Revenue - Functional"]
["Municipal governance and administration",null,{"$f":"C7+C10+C24","v":235844658.69},247348598,248174958,49329758.960000001,227618230.05000001,185841919,{"$f":"G6-H6","v":41776311.050000012},{"$f":"IF(I6=0,\"\",I6/H6)","v":0.22479487553074617},{"$f":"K7+K10+K24","v":248174958}]
["Executive and council",null,{"$f":"SUM(C8:C9)","v":6000},{"$f":"SUM(D8:D9)","v":0},0,0,0,0,{"$f":"G7-H7","v":0},{"$f":"IF(I7=0,\"\",I7/H7)","v":""},0]
["Mayor and Council",null,6000,0,0,0,0,0,0,"",0]
["Municipal Manager, Town Secretary and Chief Executive",null,0,0,0,0,0,0,0,"",0]
["Finance and administration",null,{"$f":"SUM(C11:C23)","v":235838658.69},247348598,248114958,49329758.960000001,227582146.77000001,185817919,41764227.770000011,0.22475888221522924,{"$f":"SUM(K11:K23)","v":248114958}]
["Administrative and Corporate Support",null,220752508.40000001,230307351,229358051,49251820.710000001,220049352.55000001,172350728,47698624.550000012,0.27675325253050287,229358051]
["Asset Management",null,null,null,null,null,null,null,0,""]
["Finance",null,14114986.66,16789523,16969523,3897.87,6439883.04,12664134,-6224250.96,-0.49148650511752323,16969523]
["Fleet Management",null,null,null,null,null,null,null,0,""]
["Human Resources",null,201121.51,251724,827384,74040.38,494212.18,419057,75155.179999999993,0.17934357378590501,827384]
["Information Technology",null,770042.12,0,900000,0,563440.72,360000,203440.71999999997,0.56511311111111107,900000]
["Legal Services",null,0,0,0,0,0,0,0,"",0]
["Marketing, Customer Relations, Publicity and Media Co-ordination",null,null,null,null,null,null,null,0,""]
["Property Services",null,null,null,null,null,null,null,0,""]
["Risk Management",null,0,0,0,0,0,0,0,"",0]
["Security Services",null,null,null,null,null,null,null,0,""]
["Supply Chain Management ",null,0,0,60000,0,35258.28,24000,11258.279999999999,0.46909499999999993,60000]
["Valuation Service",null,null,null,null,null,null,null,0,""]
["Internal audit",null,{"$f":"SUM(C25:C25)","v":0},0,60000,0,36083.279999999999,24000,12083.279999999999,0.50346999999999997,{"$f":"SUM(K25:K25)","v":60000}]
["Governance Function",null,0,0,60000,0,36083.279999999999,24000,12083.279999999999,0.50346999999999997,60000]
["Community and public safety",null,{"$f":"C27+C49+C55+C64+C67","v":6766968.6100000003},{"$f":"D27+D49+D55+D64+D67","v":13884801},{"$f":"E27+E49+E55+E64+E67","v":12479801},{"$f":"F27+F49+F55+F64+F67","v":869508.83},8622543.370000001,9851576,-1229032.629999999,-0.12475492550633513,{"$f":"K27+K49+K55+K64+K67","v":12479801}]
["Community and social services",null,{"$f":"SUM(C28:C48)","v":1402864},1405000,0,1980,5940,491747,-485807,-0.98792061771602069,{"$f":"SUM(K28:K48)","v":0}]
["Aged Care",null,null,null,null,null,null,null,0,""]
["Agricultural",null,null,null,null,null,null,null,0,""]
["Animal Care and Diseases",null,null,null,null,null,null,null,0,""]
["Cemeteries, Funeral Parlours and Crematoriums",null,17850,0,0,1980,5940,0,5940,{"$error":"#DIV/0!"},0]
["Child Care Facilities",null,null,null,null,null,null,null,0,""]
["Community Halls and Facilities",null,1385014,1405000,0,0,0,491747,-491747,-1,0]
["Consumer Protection",null,null,null,null,null,null,null,0,""]
["Cultural Matters",null,null,null,null,null,null,null,0,""]
["Disaster Management",null,null,null,null,null,null,null,0,""]
["Education",null,null,null,null,null,null,null,0,""]
["Indigenous and Customary Law",null,null,null,null,null,null,null,0,""]
["Industrial Promotion",null,null,null,null,null,null,null,0,""]
["Language Policy",null,null,null,null,null,null,null,0,""]
["Libraries and Archives",null,0,0,0,0,0,0,0,"",0]
["Literacy Programmes",null,null,null,null,null,null,null,0,""]
["Media Services",null,null,null,null,null,null,null,0,""]
["Museums and Art Galleries",null,null,null,null,null,null,null,0,""]
["Population Development",null,null,null,null,null,null,null,0,""]
["Provincial Cultural Matters",null,null,null,null,null,null,null,0,""]
["Theatres",null,null,null,null,null,null,null,0,""]
["Zoo's",null,null,null,null,null,null,null,0,""]
["Sport and recreation",null,{"$f":"SUM(C50:C54)","v":233209.67},{"$f":"SUM(D50:D54)","v":332},332,19345.87,328879.75,243,328636.75,1352.414609053498,332]
["Beaches and Jetties ",null,null,null,null,null,null,null,0,""]
["Casinos, Racing, Gambling, Wagering",null,null,null,null,null,null,null,0,""]
["Community Parks (including Nurseries)",null,null,null,null,null,null,null,0,""]
["Recreational Facilities",null,233209.67,332,332,19345.87,328879.75,243,328636.75,1352.414609053498,332]
["Sports Grounds and Stadiums",null,null,null,null,null,null,null,0,""]
["Public safety",null,{"$f":"SUM(C56:C63)","v":5130894.9400000004},{"$f":"SUM(D56:D63)","v":12479469},12479469,848182.96,8287723.6200000001,9359586,-1071862.3799999999,-0.11452027685839949,12479469]
["Civil Defence",null,null,null,null,null,null,null,0,""]
["Cleansing",null,null,null,null,null,null,null,0,""]
["Control of Public Nuisances",null,null,null,null,null,null,null,{"$f":"G58-H58","v":0},{"$f":"IF(I58=0,\"\",I58/H58)","v":""}]
["Fencing and Fences ",null,null,null,null,null,null,null,0,""]
["Fire Fighting and Protection",null,null,null,null,null,null,null,0,""]
["Licensing and Control of Animals",null,null,null,null,null,null,null,{"$f":"G61-H61","v":0},{"$f":"IF(I61=0,\"\",I61/H61)","v":""}]
["Police Forces, Traffic and Street Parking Control",null,5130894.9400000004,12479469,12479469,848182.96,8287723.6200000001,9359586,{"$f":"G62-H62","v":-1071862.3799999999},{"$f":"IF(I62=0,\"\",I62/H62)","v":-0.11452027685839949},12479469]
["Pounds",null,null,null,null,null,null,null,0,""]
["Housing",null,{"$f":"SUM(C65:C66)","v":0},0,0,0,0,0,{"$f":"G64-H64","v":0},{"$f":"IF(I64=0,\"\",I64/H64)","v":""},{"$f":"SUM(K65:K66)","v":0}]
["Housing",null,null,null,null,null,null,null,{"$f":"G65-H65","v":0},{"$f":"IF(I65=0,\"\",I65/H65)","v":""}]
["Informal Settlements",null,null,null,null,null,null,null,{"$f":"G66-H66","v":0},{"$f":"IF(I66=0,\"\",I66/H66)","v":""}]
["Health",null,{"$f":"SUM(C68:C74)","v":0},0,0,0,0,0,0,"",{"$f":"SUM(K68:K74)","v":0}]
["Ambulance",null,null,null,null,null,null,null,0,""]
["Health Services",null,null,null,null,null,null,null,0,""]
["Laboratory Services",null,null,null,null,null,null,null,{"$f":"G70-H70","v":0},{"$f":"IF(I70=0,\"\",I70/H70)","v":""}]
["Food Control",null,null,null,null,null,null,null,{"$f":"G71-H71","v":0},{"$f":"IF(I71=0,\"\",I71/H71)","v":""}]
["Health Surveillance and Prevention of Communicable Diseases including immunizations",null,null,null,null,null,null,null,0,""]
["Vector Control",null,null,null,null,null,null,null,0,""]
["Chemical Safety",null,null,null,null,null,null,null,0,""]
["Economic and environmental services",null,{"$f":"C76+C87+C92","v":40031927.559999995},{"$f":"D76+D87+D92","v":56172642},{"$f":"E76+E87+E92","v":56172642},6911.11,21650235.899999999,42129459,-20479223.100000001,-0.48610220938275045,{"$f":"K76+K87+K92","v":56172642}]
["Planning and development",null,{"$f":"SUM(C77:C86)","v":40031927.559999995},56172642,56172642,6911.11,164346.95000000001,42129459,-41965112.049999997,-0.99609900165107734,{"$f":"SUM(K77:K86)","v":56172642}]
["Billboards",null,null,null,null,null,null,null,{"$f":"G77-H77","v":0},{"$f":"IF(I77=0,\"\",I77/H77)","v":""}]
["Corporate Wide Strategic Planning (IDPs, LEDs)",null,0,0,0,0,0,0,0,"",0]
["Central City Improvement District",null,null,null,null,null,null,null,0,""]
["Development Facilitation",null,null,null,null,null,null,null,{"$f":"G80-H80","v":0},{"$f":"IF(I80=0,\"\",I80/H80)","v":""}]
["Economic Development/Planning",null,94835.76,2117445,2117445,0,4800,1588077,{"$f":"G81-H81","v":-1583277},{"$f":"IF(I81=0,\"\",I81/H81)","v":-0.99697747653293889},2117445]
["Regional Planning and Development",null,null,null,null,null,null,null,{"$f":"G82-H82","v":0},{"$f":"IF(I82=0,\"\",I82/H82)","v":""}]
["Town Planning, Building Regulations and Enforcement, and City Engineer",null,464679.43,1126197,1126197,6911.11,26828.560000000001,844641,{"$f":"G83-H83","v":-817812.44},{"$f":"IF(I83=0,\"\",I83/H83)","v":-0.96823673016109801},1126197]
["Project Management Unit",null,39472412.369999997,52929000,52929000,0,132718.39000000001,39696741,-39564022.609999999,-0.99665669305195603,52929000]
["Provincial Planning",null,null,null,null,null,null,null,0,""]
["Support to Local Municipalities",null,null,null,null,null,null,null,0,""]
["Road transport",null,{"$f":"SUM(C88:C91)","v":0},0,0,0,21485888.949999999,0,21485888.949999999,{"$error":"#DIV/0!"},{"$f":"SUM(K88:K91)","v":0}]
["Public Transport",null,null,null,null,null,null,null,0,""]
["Road and Traffic Regulation",null,null,null,null,null,null,null,0,""]
["Roads",null,0,0,0,0,21485888.949999999,0,21485888.949999999,{"$error":"#DIV/0!"},0]
["Taxi Ranks",null,null,null,null,null,null,null,0,""]
["Environmental protection",null,{"$f":"SUM(C93:C98)","v":0},{"$f":"SUM(D93:D98)","v":0},0,0,0,0,0,"",0]
["Biodiversity and Landscape",null,null,null,null,null,null,null,0,""]
["Coastal Protection",null,null,null,null,null,null,null,0,""]
["Indigenous Forests",null,null,null,null,null,null,null,{"$f":"G95-H95","v":0},{"$f":"IF(I95=0,\"\",I95/H95)","v":""}]
["Nature Conservation",null,null,null,null,null,null,null,{"$f":"G96-H96","v":0},{"$f":"IF(I96=0,\"\",I96/H96)","v":""}]
["Pollution Control",null,null,null,null,null,null,null,0,""]
["Soil Conservation",null,null,null,null,null,null,null,0,""]
["Trading services",null,{"$f":"C100+C104+C108+C113","v":31019919.25},{"$f":"D100+D104+D108+D113","v":32301514},{"$f":"E100+E104+E108+E113","v":34952586},{"$f":"F100+F104+F108+F113","v":1170677.22},{"$f":"G100+G104+G108+G113","v":24819992.240000002},25286520.800000001,{"$f":"I100+I104+I108+I113","v":-466528.55999999889},-1.8449693561638534E-2,{"$f":"K100+K104+K108+K113","v":34952586}]
["Energy sources",null,{"$f":"SUM(C101:C103)","v":29076343.920000002},{"$f":"SUM(D101:D103)","v":30352837},31598909,1009730.49,20526767.920000002,23263037.800000001,-2736269.879999999,-0.11762306812741365,31598909]
["Electricity ",null,29076343.920000002,30352837,31598909,1009730.49,20526767.920000002,23263037.800000001,-2736269.879999999,-0.11762306812741365,31598909]
["Street Lighting and Signal Systems",null,null,null,null,null,null,null,{"$f":"G102-H102","v":0},{"$f":"IF(I102=0,\"\",I102/H102)","v":""}]
["Nonelectric Energy",null,null,null,null,null,null,null,0,""]
["Water management",null,{"$f":"SUM(C105:C107)","v":206931.24},{"$f":"SUM(D105:D107)","v":146962},146962,0,69795.58,110214,-40418.42,-0.36672673163119024,146962]
["Water Treatment",null,null,null,null,null,null,null,0,""]
["Water Distribution",null,206931.24,146962,146962,0,69795.58,110214,{"$f":"G106-H106","v":-40418.42},{"$f":"IF(I106=0,\"\",I106/H106)","v":-0.36672673163119024},146962]
["Water Storage",null,null,null,null,null,null,null,0,""]
["Waste water management",null,{"$f":"SUM(C109:C112)","v":0},{"$f":"SUM(D109:D112)","v":365798},365798,0,1886506.05,274347,1612159.05,5.876350206125819,365798]
["Public Toilets",null,null,null,null,null,null,null,0,""]
["Sewerage",null,0,365798,365798,0,148882.35,274347,-125464.65,-0.45732102045949108,365798]
["Storm Water Management",null,0,0,0,0,1737623.7,0,{"$f":"G111-H111","v":1737623.7},{"$f":"IF(I111=0,\"\",I111/H111)","v":{"$error":"#DIV/0!"}},0]
["Waste Water Treatment",null,null,null,null,null,null,null,0,""]
["Waste management",null,{"$f":"SUM(C114:C117)","v":1736644.09},1435917,2840917,160946.73000000001,2336922.69,1638922,698000.69,0.42589012167754164,{"$f":"SUM(K114:K117)","v":2840917}]
["Recycling",null,null,null,null,null,null,null,{"$f":"G114-H114","v":0},{"$f":"IF(I114=0,\"\",I114/H114)","v":""}]
["Solid Waste Disposal (Landfill Sites)",null,null,null,null,null,null,null,{"$f":"G115-H115","v":0},{"$f":"IF(I115=0,\"\",I115/H115)","v":""}]
["Solid Waste Removal",null,1736644.09,1435917,2840917,160946.73000000001,2336922.69,1638922,698000.69,0.42589012167754164,2840917]
["Street Cleaning",null,null,null,null,null,null,null,{"$f":"G117-H117","v":0},{"$f":"IF(I117=0,\"\",I117/H117)","v":""}]
["Other",null,{"$f":"SUM(C119:C124)","v":0},{"$f":"SUM(D119:D124)","v":0},0,0,0,0,0,"",0]
["Abattoirs",null,null,null,null,null,null,null,0,""]
["Air Transport",null,null,null,null,null,null,null,0,""]
["Forestry ",null,null,null,null,null,null,null,{"$f":"G121-H121","v":0},{"$f":"IF(I121=0,\"\",I121/H121)","v":""}]
["Licensing and Regulation",null,null,null,null,null,null,null,0,""]
["Markets",null,null,null,null,null,null,null,0,""]
["Tourism",null,null,null,null,null,null,null,{"$f":"G124-H124","v":0},{"$f":"IF(I124=0,\"\",I124/H124)","v":""}]
[{"$f":"\"Total \"&A5","v":"Total Revenue - Functional"},2,{"$f":"C6+C26+C75+C99+C118","v":313663474.11000001},{"$f":"D6+D26+D75+D99+D118","v":349707555},351779987,51376856.119999997,282711001.56,263109474.80000001,{"$f":"G125-H125","v":19601526.75999999},{"$f":"IF(I125=0,\"\",I125/H125)","v":7.4499509281829898E-2},{"$f":"K6+K26+K75+K99+K118","v":351779987}]
[]
["Expenditure - Functional"]
[{"$f":"A6","v":"Municipal governance and administration"},null,{"$f":"C129+C132+C146","v":162515402.66999999},{"$f":"D129+D132+D146","v":145793806},{"$f":"E129+E132+E146","v":154318370},{"$f":"F129+F132+F146","v":3224788.33},104885535.62,{"$f":"H129+H132+H146","v":112791666.57000001},{"$f":"G128-H128","v":-7906130.950000003},{"$f":"IF(I128=0,\"\",I128/H128)","v":-7.0094991859113567E-2},{"$f":"K129+K132+K146","v":154318370}]
["Executive and council",null,{"$f":"SUM(C130:C131)","v":35591736.700000003},41625382,43815523,470988.55,24796472.73,32188348.370000001,-7391875.6400000006,-0.22964445255256818,43815523]
["Mayor and Council",null,24639866.920000002,30390613,31966920,395026.05,17069270.850000001,23423796.800000001,-6354525.9499999993,-0.27128505272894099,31966920]
["Municipal Manager, Town Secretary and Chief Executive",null,10951869.779999999,11234769,11848603,75962.5,7727201.8799999999,8764551.5700000003,-1037349.6900000004,-0.11835741757179259,11848603]
["Finance and administration",null,{"$f":"SUM(C133:C145)","v":116176176.68999998},91979689,97738179,2753799.7800000003,70562054.989999995,71359070.939999998,-797015.95000000298,-1.1169090901844118E-2,{"$f":"SUM(K133:K145)","v":97738179}]
["Administrative and Corporate Support",null,65938252.600000001,37251989,35877092,1104257.2,35019911.759999998,27249254.23,7770657.5299999975,0.28516954865667155,35877092]
["Asset Management",null,null,null,null,null,null,null,0,""]
["Finance",null,19450122.199999999,24787656,29368835,523863.03999999998,15864432.369999999,20458483.57,-4594051.2000000011,-0.22455482510622859,29368835]
["Fleet Management",null,null,null,null,null,null,null,0,""]
["Human Resources",null,6645175.6299999999,6929696,7742103,32271.15,5116105.4400000004,5802345.7400000002,-686240.29999999981,-0.11826946044756026,7742103]
["Information Technology",null,11098915.300000001,10037286,10213017,653915.56000000006,5835187.0800000001,7493342.4000000004,-1658155.3200000003,-0.22128380520820726,10213017]
["Legal Services",null,4790514.5599999996,3812174,5034773,15972.48,2627961.4900000002,3348240.6,-720279.10999999987,-0.21512167016910311,5034773]
["Marketing, Customer Relations, Publicity and Media Co-ordination",null,null,null,null,null,null,null,0,""]
["Property Services",null,null,null,null,null,null,null,0,""]
["Risk Management",null,614412.74,995097,1014578,22616,566307.68000000005,754189.4,-187881.71999999997,-0.24911742328916311,1014578]
["Security Services",null,null,null,null,null,null,null,0,""]
["Supply Chain Management ",null,7638783.6600000001,8165791,8487781,400904.35,5532149.1699999999,6253215,-721065.83000000007,-0.11531121671012433,8487781]
["Valuation Service",null,null,null,null,null,null,null,0,""]
["Internal audit",null,{"$f":"SUM(C147:C147)","v":10747489.279999999},12188735,12764668,0,9527007.9000000004,9244247.2599999998,282760.6400000006,3.0587740899522479E-2,{"$f":"SUM(K147:K147)","v":12764668}]
["Governance Function",null,10747489.279999999,12188735,12764668,0,9527007.9000000004,9244247.2599999998,282760.6400000006,3.0587740899522479E-2,12764668]
["Community and public safety",null,{"$f":"C149+C171+C177+C186+C189","v":31625084.519999996},{"$f":"D149+D171+D177+D186+D189","v":32650607},31979380,39876.92,21215805.939999998,24210924.199999999,-2995118.2600000016,-0.12370937330843412,{"$f":"K149+K171+K177+K186+K189","v":31979380}]
["Community and social services",null,{"$f":"SUM(C150:C170)","v":5908411.3099999996},10211046,9555834,0,3970286.63,7396474.2000000002,-3426187.5700000003,-0.46321902535670312,{"$f":"SUM(K150:K170)","v":9555834}]
["Aged Care",null,null,null,null,null,null,null,0,""]
["Agricultural",null,null,null,null,null,null,null,0,""]
["Animal Care and Diseases",null,null,null,null,null,null,null,0,""]
["Cemeteries, Funeral Parlours and Crematoriums",null,995673.82,1398787,1369340,0,660352.54,1037360.2,-377007.65999999992,-0.36342984818580848,1369340]
["Child Care Facilities",null,null,null,null,null,null,null,0,""]
["Community Halls and Facilities",null,3123116.27,6893499,6177211,0,2159651.9,4883759.8,-2724107.9,-0.55778908291108009,6177211]
["Consumer Protection",null,null,null,null,null,null,null,0,""]
["Cultural Matters",null,null,null,null,null,null,null,{"$f":"G157-H157","v":0},{"$f":"IF(I157=0,\"\",I157/H157)","v":""}]
["Disaster Management",null,null,null,null,null,null,null,{"$f":"G158-H158","v":0},{"$f":"IF(I158=0,\"\",I158/H158)","v":""}]
["Education",null,null,null,null,null,null,null,{"$f":"G159-H159","v":0},{"$f":"IF(I159=0,\"\",I159/H159)","v":""}]
["Indigenous and Customary Law",null,null,null,null,null,null,null,0,""]
["Industrial Promotion",null,null,null,null,null,null,null,0,""]
["Language Policy",null,null,null,null,null,null,null,0,""]
["Libraries and Archives",null,1789621.22,1918760,2009283,0,1150282.19,1475354.2,-325072.01,-0.22033489313955931,2009283]
["Literacy Programmes",null,null,null,null,null,null,null,0,""]
["Media Services",null,null,null,null,null,null,null,0,""]
["Museums and Art Galleries",null,null,null,null,null,null,null,0,""]
["Population Development",null,null,null,null,null,null,null,0,""]
["Provincial Cultural Matters",null,null,null,null,null,null,null,0,""]
["Theatres",null,null,null,null,null,null,null,0,""]
["Zoo's",null,null,null,null,null,null,null,0,""]
["Sport and recreation",null,{"$f":"SUM(C172:C176)","v":3591191.65},3484575,3628560,1814.78,1877842.81,2662113,-784270.19,-0.29460439508014874,3628560]
["Beaches and Jetties ",null,null,null,null,null,null,null,0,""]
["Casinos, Racing, Gambling, Wagering",null,null,null,null,null,null,null,0,""]
["Community Parks (including Nurseries)",null,null,null,null,null,null,null,0,""]
["Recreational Facilities",null,3591191.65,3484575,3628560,1814.78,1877842.81,2662113,-784270.19,-0.29460439508014874,3628560]
["Sports Grounds and Stadiums",null,null,null,null,null,null,null,0,""]
["Public safety",null,{"$f":"SUM(C178:C185)","v":22125481.559999999},18954986,18794986,38062.14,15367676.5,14152337,1215339.5,8.587553419622497E-2,18794986]
["Civil Defence",null,null,null,null,null,null,null,0,""]
["Cleansing",null,null,null,null,null,null,null,0,""]
["Control of Public Nuisances",null,null,null,null,null,null,null,{"$f":"G180-H180","v":0},{"$f":"IF(I180=0,\"\",I180/H180)","v":""}]
["Fencing and Fences ",null,null,null,null,null,null,null,0,""]
["Fire Fighting and Protection",null,null,null,null,null,null,null,0,""]
["Licensing and Control of Animals",null,null,null,null,null,null,null,{"$f":"G183-H183","v":0},{"$f":"IF(I183=0,\"\",I183/H183)","v":""}]
["Police Forces, Traffic and Street Parking Control",null,22125481.559999999,18954986,18794986,38062.14,15367676.5,14152337,{"$f":"G184-H184","v":1215339.5},{"$f":"IF(I184=0,\"\",I184/H184)","v":8.587553419622497E-2},18794986]
["Pounds",null,null,null,null,null,null,null,0,""]
["Housing",null,{"$f":"SUM(C187:C188)","v":0},0,0,0,0,0,{"$f":"G186-H186","v":0},{"$f":"IF(I186=0,\"\",I186/H186)","v":""},{"$f":"SUM(K187:K188)","v":0}]
["Housing",null,null,null,null,null,null,null,{"$f":"G187-H187","v":0},{"$f":"IF(I187=0,\"\",I187/H187)","v":""}]
["Informal Settlements",null,null,null,null,null,null,null,{"$f":"G188-H188","v":0},{"$f":"IF(I188=0,\"\",I188/H188)","v":""}]
["Health",null,{"$f":"SUM(C190:C196)","v":0},0,0,0,0,0,0,"",0]
["Ambulance",null,null,null,null,null,null,null,0,""]
["Health Services",null,null,null,null,null,null,null,0,""]
[{"$f":"A70","v":"Laboratory Services"},null,null,null,null,null,null,null,0,""]
["Food Control",null,null,null,null,null,null,null,{"$f":"G193-H193","v":0},{"$f":"IF(I193=0,\"\",I193/H193)","v":""}]
["Health Surveillance and Prevention of Communicable Diseases including immunizations",null,null,null,null,null,null,null,{"$f":"G194-H194","v":0},{"$f":"IF(I194=0,\"\",I194/H194)","v":""}]
["Vector Control",null,null,null,null,null,null,null,0,""]
["Chemical Safety",null,null,null,null,null,null,null,0,""]
["Economic and environmental services",null,{"$f":"C198+C209+C214","v":25412846},24340871,22829717,540356.51,11730711.390000001,17625498.52,-5894787.129999999,-0.33444654761458625,{"$f":"K198+K209+K214","v":22829717}]
["Planning and development",null,{"$f":"SUM(C199:C208)","v":14645203.039999999},16980667,15629513,236740.50999999998,7719549.4199999999,12160303.52,-4440754.0999999996,-0.36518447855321295,15629513]
["Billboards",null,null,null,null,null,null,null,0,""]
["Corporate Wide Strategic Planning (IDPs, LEDs)",null,4352662.78,4771219,3647409,228223.08,669760.53,3128912,-2459151.4699999997,-0.78594459352004775,3647409]
["Central City Improvement District",null,null,null,null,null,null,null,0,""]
["Development Facilitation",null,null,null,null,null,null,null,{"$f":"G202-H202","v":0},{"$f":"IF(I202=0,\"\",I202/H202)","v":""}]
["Economic Development/Planning",null,4868658.3600000003,5943210,5961629,0,3100455.96,4447369.66,{"$f":"G203-H203","v":-1346913.7000000002},{"$f":"IF(I203=0,\"\",I203/H203)","v":-0.30285625054158422},5961629]
["Regional Planning and Development",null,null,null,null,null,null,null,{"$f":"G204-H204","v":0},{"$f":"IF(I204=0,\"\",I204/H204)","v":""}]
["Town Planning, Building Regulations and Enforcement, and City Engineer",null,2213264.52,2791167,2727692,0,2051100.25,2050546.06,{"$f":"G205-H205","v":554.18999999994412},{"$f":"IF(I205=0,\"\",I205/H205)","v":2.7026459478795813E-4},2727692]
["Project Management Unit",null,3210617.38,3475071,3292783,8517.43,1898232.68,2533475.7999999998,{"$f":"G206-H206","v":-635243.11999999988},{"$f":"IF(I206=0,\"\",I206/H206)","v":-0.25073976234547019},3292783]
["Provincial Planning",null,null,null,null,null,null,null,0,""]
["Support to Local Municipalities",null,null,null,null,null,null,null,0,""]
["Road transport",null,{"$f":"SUM(C210:C213)","v":10767642.960000001},7360204,7200204,303616,4011161.97,5465195,-1454033.0299999998,-0.26605327531771505,{"$f":"SUM(K210:K213)","v":7200204}]
["Public Transport",null,null,null,null,null,null,null,0,""]
["Road and Traffic Regulation",null,null,null,null,null,null,null,{"$f":"G211-H211","v":0},{"$f":"IF(I211=0,\"\",I211/H211)","v":""}]
["Roads",null,10767642.960000001,7360204,7200204,303616,4011161.97,5465195,-1454033.0299999998,-0.26605327531771505,7200204]
["Taxi Ranks",null,null,null,null,null,null,null,0,""]
["Environmental protection",null,{"$f":"SUM(C215:C220)","v":0},0,0,0,0,0,0,"",0]
["Biodiversity and Landscape",null,null,null,null,null,null,null,0,""]
["Coastal Protection",null,null,null,null,null,null,null,0,""]
["Indigenous Forests",null,null,null,null,null,null,null,0,""]
["Nature Conservation",null,null,null,null,null,null,null,{"$f":"G218-H218","v":0},{"$f":"IF(I218=0,\"\",I218/H218)","v":""}]
["Pollution Control",null,null,null,null,null,null,null,{"$f":"G219-H219","v":0},{"$f":"IF(I219=0,\"\",I219/H219)","v":""}]
["Soil Conservation",null,null,null,null,null,null,null,0,""]
["Trading services",null,{"$f":"C222+C226+C230+C235","v":89440881.75},{"$f":"D222+D226+D230+D235","v":82525760},84375522,-12240092.460000001,40691538.060000002,62634677.799999997,-21943139.739999998,-0.35033531760260767,{"$f":"K222+K226+K230+K235","v":84375522}]
["Energy sources",null,{"$f":"SUM(C223:C225)","v":48671083.350000001},46298999,47947380,-12331230.15,17298831.280000001,35383755.399999999,-18084924.119999997,-0.5111081035790791,47947380]
["Electricity ",null,48671083.350000001,46298999,47947380,-12331230.15,17298831.280000001,35383755.399999999,-18084924.119999997,-0.5111081035790791,47947380]
["Street Lighting and Signal Systems",null,null,null,null,null,null,null,{"$f":"G224-H224","v":0},{"$f":"IF(I224=0,\"\",I224/H224)","v":""}]
["Nonelectric Energy",null,null,null,null,null,null,null,0,""]
["Water management",null,{"$f":"SUM(C227:C229)","v":7217372.5499999998},6631392,7480167,0,4624871.5199999996,5313144,-688272.48000000045,-0.12954146923177698,7480167]
["Water Treatment",null,null,null,null,null,null,null,0,""]
["Water Distribution",null,7217372.5499999998,6631392,7480167,0,4624871.5199999996,5313144,{"$f":"G228-H228","v":-688272.48000000045},{"$f":"IF(I228=0,\"\",I228/H228)","v":-0.12954146923177698},7480167]
["Water Storage",null,null,null,null,null,null,null,0,""]
["Waste water management",null,{"$f":"SUM(C231:C234)","v":23385006.330000002},18265366,18975477,4316.6000000000004,10747672.029999999,13983196.4,-3235524.370000001,-0.23138660699924096,18975477]
["Public Toilets",null,null,null,null,null,null,null,0,""]
["Sewerage",null,134733.23000000001,113151,113151,0,0,84879,-84879,-1,113151]
["Storm Water Management",null,23250273.100000001,18152215,18862326,4316.6000000000004,10747672.029999999,13898317.4,{"$f":"G233-H233","v":-3150645.370000001},{"$f":"IF(I233=0,\"\",I233/H233)","v":-0.22669257575021282},18862326]
["Waste Water Treatment",null,null,null,null,null,null,null,0,""]
["Waste management",null,{"$f":"SUM(C236:C239)","v":10167419.52},11330003,9972498,86821.09,8020163.2300000004,7954582,65581.230000000447,8.2444596083113414E-3,{"$f":"SUM(K236:K239)","v":9972498}]
["Recycling",null,null,null,null,null,null,null,{"$f":"G236-H236","v":0},{"$f":"IF(I236=0,\"\",I236/H236)","v":""}]
["Solid Waste Disposal (Landfill Sites)",null,null,null,null,null,null,null,{"$f":"G237-H237","v":0},{"$f":"IF(I237=0,\"\",I237/H237)","v":""}]
["Solid Waste Removal",null,10167419.52,11330003,9972498,86821.09,8020163.2300000004,7954582,{"$f":"G238-H238","v":65581.230000000447},{"$f":"IF(I238=0,\"\",I238/H238)","v":8.2444596083113414E-3},9972498]
["Street Cleaning",null,null,null,null,null,null,null,0,""]
["Other",null,{"$f":"SUM(C241:C246)","v":0},0,0,0,0,0,0,"",0]
["Abattoirs",null,null,null,null,null,null,null,0,""]
["Air Transport",null,null,null,null,null,null,null,0,""]
["Forestry ",null,null,null,null,null,null,null,{"$f":"G243-H243","v":0},{"$f":"IF(I243=0,\"\",I243/H243)","v":""}]
["Licensing and Regulation",null,null,null,null,null,null,null,0,""]
["Markets",null,null,null,null,null,null,null,{"$f":"G245-H245","v":0},{"$f":"IF(I245=0,\"\",I245/H245)","v":""}]
["Tourism",null,null,null,null,null,null,null,{"$f":"G246-H246","v":0},{"$f":"IF(I246=0,\"\",I246/H246)","v":""}]
[{"$f":"\"Total \"&A127","v":"Total Expenditure - Functional"},3,{"$f":"C128+C148+C197+C221+C240","v":308994214.94},{"$f":"D128+D148+D197+D221+D240","v":285311044},293502989,-8435070.7000000011,178523591.00999999,217262767.09000003,-38739176.079999998,{"$f":"IF(I247=0,\"\",I247/H247)","v":-0.17830563698911414},{"$f":"K128+K148+K197+K221+K240","v":293502989}]
[{"$f":"result","v":"Surplus/ (Deficit) for the year"},null,{"$f":"C125-C247","v":4669259.1700000167},64396511,58276998,59811926.82,104187410.55000001,{"$f":"H125-H247","v":45846707.709999979},{"$f":"G248-H248","v":58340702.840000033},{"$f":"IF(I248=0,\"\",I248/H248)","v":1.2725167357497056},{"$f":"K125-K247","v":58276998}]
[{"$f":"head27a","v":"References"}]
["1. Government Finance Statistics Functions and Sub-functions are standardised to assist national and international accounts and comparison"]
["2. Total Revenue by Functional Classification must reconcile to total operating revenue shown in Financial Performance (revenue and expenditure)"]
["3. Total Expenditure by Functional Classification must reconcile to total operating expenditure shown in Financial Performance (revenue and expenditure)"]
["4. All amounts must be classified under a Functional classification. The function 'Other' is only for Abbatoirs, Air Transport, Licensing and Regulation, Markets and Tourism - and if used must be supported by footnotes. Nothing else may be placed under 'Other'. Assign associate share to relevant classification"]
[]
[]
["check oprev balance",null,{"$f":"C125-'C4-FinPerf RE'!C66","v":735806.63999998569},{"$f":"D125-'C4-FinPerf RE'!D66","v":251724},{"$f":"E125-'C4-FinPerf RE'!E66","v":827384},{"$f":"F125-'C4-FinPerf RE'!F66","v":74040.379999995232},{"$f":"G125-'C4-FinPerf RE'!G66","v":494212.18000000715},{"$f":"H125-'C4-FinPerf RE'!H66","v":419057},{"$f":"I125-'C4-FinPerf RE'!I66","v":19601526.75999999},null,{"$f":"K125-'C4-FinPerf RE'!K66","v":827384}]
["check opexp balance",null,{"$f":"C247-'C4-FinPerf RE'!C49","v":0},{"$f":"D247-'C4-FinPerf RE'!D49","v":0},{"$f":"E247-'C4-FinPerf RE'!E49","v":0},{"$f":"F247-'C4-FinPerf RE'!F49","v":0},{"$f":"G247-'C4-FinPerf RE'!G49","v":0},{"$f":"H247-'C4-FinPerf RE'!H49","v":0},{"$f":"I247-'C4-FinPerf RE'!I49","v":0},null,{"$f":"K247-'C4-FinPerf RE'!K49","v":0}]

{"sheet":"C3-FinPerf V","index":9,"n_rows":43,"n_cols":11,"rows_kept":43,"cut":false,"hidden":false,"merged":[[0,0,0,10],[1,1,3,1],[1,3,1,10]]}
[{"$f":"muni& \" - \"&S71C& \" - \"&date","v":"LIM353 Molemole - Table C3 Monthly Budget Statement - Financial Performance (revenue and expenditure by municipal vote) - Q3 Third Quarter"}]
[{"$f":"Vdesc","v":"Vote Description"},{"$f":"head27","v":"Ref"},{"$f":"Head1","v":"2024/25"},{"$f":"Head2","v":"Budget Year 2025/26"}]
[null,null,{"$f":"Head5","v":"Audited Outcome"},{"$f":"Head6","v":"Original Budget"},{"$f":"Head7","v":"Adjusted Budget"},{"$f":"Head38","v":"Monthly actual"},{"$f":"Head39","v":"YearTD actual"},{"$f":"Head40","v":"YearTD budget"},{"$f":"Head41","v":"YTD variance"},{"$f":"Head41","v":"YTD variance"},{"$f":"Head8","v":"Full Year Forecast"}]
["R thousands",null,null,null,null,null,null,null,null,"%"]
["Revenue by Vote",1]
[{"$f":"'Org structure'!A2","v":"Vote 01 - Corporate Services"},null,{"$f":"'C3C'!C6","v":1957820.13},{"$f":"'C3C'!D6","v":3916995},{"$f":"'C3C'!E6","v":5643355},{"$f":"'C3C'!F6","v":1820612.59},{"$f":"'C3C'!G6","v":2828942.56},{"$f":"'C3C'!H6","v":3628270},{"$f":"G6-H6","v":-799327.44},{"$f":"IF(I6=0,\"\",I6/H6)","v":-0.22030539072340261},{"$f":"'C3C'!K6","v":5643355}]
[{"$f":"'Org structure'!A3","v":"Vote 02 - Municipal Manager"},null,{"$f":"'C3C'!C15","v":0},{"$f":"'C3C'!D15","v":0},{"$f":"'C3C'!E15","v":60000},{"$f":"'C3C'!F15","v":0},{"$f":"'C3C'!G15","v":36083.279999999999},{"$f":"'C3C'!H15","v":24000},12083.279999999999,0.50346999999999997,{"$f":"'C3C'!K15","v":60000}]
[{"$f":"'Org structure'!A4","v":"Vote 03 - Mayors Office"},null,{"$f":"'C3C'!C21","v":0},{"$f":"'C3C'!D21","v":0},{"$f":"'C3C'!E21","v":0},{"$f":"'C3C'!F21","v":0},{"$f":"'C3C'!G21","v":0},{"$f":"'C3C'!H21","v":0},0,"",{"$f":"'C3C'!K21","v":0}]
[{"$f":"'Org structure'!A5","v":"Vote 04 - Budget And Treasury"},null,{"$f":"'C3C'!C27","v":234446353.75},{"$f":"'C3C'!D27","v":246675245},{"$f":"'C3C'!E27","v":245715245},{"$f":"'C3C'!F27","v":47516057.479999997},{"$f":"'C3C'!G27","v":224784832.77000001},{"$f":"'C3C'!H27","v":184622367},40162465.770000011,0.21753846201094373,{"$f":"'C3C'!K27","v":245715245}]
[{"$f":"'Org structure'!A6","v":"Vote 05 - Community Services"},null,{"$f":"'C3C'!C34","v":8503612.7000000011},{"$f":"'C3C'!D34","v":15320718},{"$f":"'C3C'!E34","v":15320718},{"$f":"'C3C'!F34","v":1030455.5599999999},{"$f":"'C3C'!G34","v":10959466.060000001},{"$f":"'C3C'!H34","v":11490498},-531031.93999999948,-4.6214875978395319E-2,{"$f":"'C3C'!K34","v":15320718}]
[{"$f":"'Org structure'!A7","v":"Vote 06 - Technical Services"},null,{"$f":"'C3C'!C41","v":68755687.529999986},{"$f":"'C3C'!D41","v":83794597},{"$f":"'C3C'!E41","v":85040669},{"$f":"'C3C'!F41","v":1009730.49},{"$f":"'C3C'!G41","v":44101676.890000001},{"$f":"'C3C'!H41","v":63344339.799999997},-19242662.909999996,-0.3037787270457904,{"$f":"'C3C'!K41","v":85040669}]
[{"$f":"'Org structure'!A8","v":"Vote 07 - "},null,{"$f":"'C3C'!C50","v":0},{"$f":"'C3C'!D50","v":0},{"$f":"'C3C'!E50","v":0},{"$f":"'C3C'!F50","v":0},{"$f":"'C3C'!G50","v":0},{"$f":"'C3C'!H50","v":0},{"$f":"G12-H12","v":0},{"$f":"IF(I12=0,\"\",I12/H12)","v":""},{"$f":"'C3C'!K50","v":0}]
[{"$f":"'Org structure'!A9","v":"Vote 08 - "},null,{"$f":"'C3C'!C51","v":0},{"$f":"'C3C'!D51","v":0},{"$f":"'C3C'!E51","v":0},{"$f":"'C3C'!F51","v":0},{"$f":"'C3C'!G51","v":0},{"$f":"'C3C'!H51","v":0},0,"",{"$f":"'C3C'!K51","v":0}]
[{"$f":"'Org structure'!A10","v":"Vote 09 - "},null,{"$f":"'C3C'!C52","v":0},{"$f":"'C3C'!D52","v":0},{"$f":"'C3C'!E52","v":0},{"$f":"'C3C'!F52","v":0},{"$f":"'C3C'!G52","v":0},{"$f":"'C3C'!H52","v":0},0,"",{"$f":"'C3C'!K52","v":0}]
[{"$f":"'Org structure'!A11","v":"Vote 10 - "},null,{"$f":"'C3C'!C53","v":0},{"$f":"'C3C'!D53","v":0},{"$f":"'C3C'!E53","v":0},{"$f":"'C3C'!F53","v":0},{"$f":"'C3C'!G53","v":0},{"$f":"'C3C'!H53","v":0},0,"",{"$f":"'C3C'!K53","v":0}]
[{"$f":"'Org structure'!A12","v":"Vote 11 - "},null,{"$f":"'C3C'!C54","v":0},{"$f":"'C3C'!D54","v":0},{"$f":"'C3C'!E54","v":0},{"$f":"'C3C'!F54","v":0},{"$f":"'C3C'!G54","v":0},{"$f":"'C3C'!H54","v":0},0,"",{"$f":"'C3C'!K54","v":0}]
[{"$f":"'Org structure'!A13","v":"Vote 12 - "},null,{"$f":"'C3C'!C55","v":0},{"$f":"'C3C'!D55","v":0},{"$f":"'C3C'!E55","v":0},{"$f":"'C3C'!F55","v":0},{"$f":"'C3C'!G55","v":0},{"$f":"'C3C'!H55","v":0},0,"",{"$f":"'C3C'!K55","v":0}]
[{"$f":"'Org structure'!A14","v":"Vote 13 - "},null,{"$f":"'C3C'!C56","v":0},{"$f":"'C3C'!D56","v":0},{"$f":"'C3C'!E56","v":0},{"$f":"'C3C'!F56","v":0},{"$f":"'C3C'!G56","v":0},{"$f":"'C3C'!H56","v":0},0,"",{"$f":"'C3C'!K56","v":0}]
[{"$f":"'Org structure'!A15","v":"Vote 14 - "},null,{"$f":"'C3C'!C57","v":0},{"$f":"'C3C'!D57","v":0},{"$f":"'C3C'!E57","v":0},{"$f":"'C3C'!F57","v":0},{"$f":"'C3C'!G57","v":0},{"$f":"'C3C'!H57","v":0},0,"",{"$f":"'C3C'!K57","v":0}]
[{"$f":"'Org structure'!A16","v":"Vote 15 - Other"},null,{"$f":"'C3C'!C58","v":0},{"$f":"'C3C'!D58","v":0},{"$f":"'C3C'!E58","v":0},{"$f":"'C3C'!F58","v":0},{"$f":"'C3C'!G58","v":0},{"$f":"'C3C'!H58","v":0},0,"",{"$f":"'C3C'!K58","v":0}]
["Total Revenue by Vote",2,{"$f":"SUM(C6:C20)","v":313663474.10999995},{"$f":"SUM(D6:D20)","v":349707555},351779987,51376856.120000005,282711001.56,263109474.80000001,19601526.76000002,7.4499509281830009E-2,{"$f":"SUM(K6:K20)","v":351779987}]
[]
["Expenditure by Vote",1]
[{"$f":"'Org structure'!A2","v":"Vote 01 - Corporate Services"},null,{"$f":"'C3C'!C62","v":63325473.25},{"$f":"'C3C'!D62","v":67364632},{"$f":"'C3C'!E62","v":67641759},{"$f":"'C3C'!F62","v":1521487.4600000002},{"$f":"'C3C'!G62","v":38952484.199999996},{"$f":"'C3C'!H62","v":50809915.829999998},{"$f":"G24-H24","v":-11857431.630000003},{"$f":"IF(I24=0,\"\",I24/H24)","v":-0.2333684564578426},{"$f":"'C3C'!K62","v":67641759}]
[{"$f":"'Org structure'!A3","v":"Vote 02 - Municipal Manager"},null,{"$f":"'C3C'!C71","v":27104286.359999999},{"$f":"'C3C'!D71","v":28230775},{"$f":"'C3C'!E71","v":30662622},{"$f":"'C3C'!F71","v":114550.98},{"$f":"'C3C'!G71","v":20448478.950000003},{"$f":"'C3C'!H71","v":22111228.829999998},-1662749.8799999952,-7.5199342957548113E-2,{"$f":"'C3C'!K71","v":30662622}]
[{"$f":"'Org structure'!A4","v":"Vote 03 - Mayors Office"},null,{"$f":"'C3C'!C77","v":17205165.640000001},{"$f":"'C3C'!D77","v":20443276},{"$f":"'C3C'!E77","v":20345171},{"$f":"'C3C'!F77","v":76302.45},{"$f":"'C3C'!G77","v":11571156.6},{"$f":"'C3C'!H77","v":15293410},-3722253.4000000004,-0.24338936836192845,{"$f":"'C3C'!K77","v":20345171}]
[{"$f":"'Org structure'!A5","v":"Vote 04 - Budget And Treasury"},null,{"$f":"'C3C'!C83","v":64583665.669999994},{"$f":"'C3C'!D83","v":40970823},{"$f":"'C3C'!E83","v":45706992},{"$f":"'C3C'!F83","v":1480364.85},{"$f":"'C3C'!G83","v":38502573},{"$f":"'C3C'!H83","v":32483014.629999999},6019558.370000001,0.18531403068853652,{"$f":"'C3C'!K83","v":45706992}]
[{"$f":"'Org structure'!A6","v":"Vote 05 - Community Services"},null,{"$f":"'C3C'!C90","v":41798936.960000001},{"$f":"'C3C'!D90","v":43980610},{"$f":"'C3C'!E90","v":41951878},{"$f":"'C3C'!F90","v":127280.08},{"$f":"'C3C'!G90","v":29240625.729999997},{"$f":"'C3C'!H90","v":32165506.199999999},-2924880.4700000025,-9.0932207060991393E-2,{"$f":"'C3C'!K90","v":41951878}]
[{"$f":"'Org structure'!A7","v":"Vote 06 - Technical Services"},null,{"$f":"'C3C'!C97","v":94976687.060000002},{"$f":"'C3C'!D97","v":84320928},{"$f":"'C3C'!E97","v":87194567},{"$f":"'C3C'!F97","v":-11755056.52},{"$f":"'C3C'!G97","v":39808272.530000001},{"$f":"'C3C'!H97","v":64399691.599999994},-24591419.069999993,-0.38185616202547151,{"$f":"'C3C'!K97","v":87194567}]
[{"$f":"'Org structure'!A8","v":"Vote 07 - "},null,{"$f":"'C3C'!C106","v":0},{"$f":"'C3C'!D106","v":0},{"$f":"'C3C'!E106","v":0},{"$f":"'C3C'!F106","v":0},{"$f":"'C3C'!G106","v":0},{"$f":"'C3C'!H106","v":0},{"$f":"G30-H30","v":0},{"$f":"IF(I30=0,\"\",I30/H30)","v":""},{"$f":"'C3C'!K106","v":0}]
[{"$f":"'Org structure'!A9","v":"Vote 08 - "},null,{"$f":"'C3C'!C107","v":0},{"$f":"'C3C'!D107","v":0},{"$f":"'C3C'!E107","v":0},{"$f":"'C3C'!F107","v":0},{"$f":"'C3C'!G107","v":0},{"$f":"'C3C'!H107","v":0},0,"",{"$f":"'C3C'!K107","v":0}]
[{"$f":"'Org structure'!A10","v":"Vote 09 - "},null,{"$f":"'C3C'!C108","v":0},{"$f":"'C3C'!D108","v":0},{"$f":"'C3C'!E108","v":0},{"$f":"'C3C'!F108","v":0},{"$f":"'C3C'!G108","v":0},{"$f":"'C3C'!H108","v":0},0,"",{"$f":"'C3C'!K108","v":0}]
[{"$f":"'Org structure'!A11","v":"Vote 10 - "},null,{"$f":"'C3C'!C109","v":0},{"$f":"'C3C'!D109","v":0},{"$f":"'C3C'!E109","v":0},{"$f":"'C3C'!F109","v":0},{"$f":"'C3C'!G109","v":0},{"$f":"'C3C'!H109","v":0},0,{"$f":"IF(I33=0,\"\",I33/H33)","v":""},{"$f":"'C3C'!K109","v":0}]
[{"$f":"'Org structure'!A12","v":"Vote 11 - "},null,{"$f":"'C3C'!C110","v":0},{"$f":"'C3C'!D110","v":0},{"$f":"'C3C'!E110","v":0},{"$f":"'C3C'!F110","v":0},{"$f":"'C3C'!G110","v":0},{"$f":"'C3C'!H110","v":0},0,{"$f":"IF(I34=0,\"\",I34/H34)","v":""},{"$f":"'C3C'!K110","v":0}]
[{"$f":"'Org structure'!A13","v":"Vote 12 - "},null,{"$f":"'C3C'!C111","v":0},{"$f":"'C3C'!D111","v":0},{"$f":"'C3C'!E111","v":0},{"$f":"'C3C'!F111","v":0},{"$f":"'C3C'!G111","v":0},{"$f":"'C3C'!H111","v":0},0,{"$f":"IF(I35=0,\"\",I35/H35)","v":""},{"$f":"'C3C'!K111","v":0}]
[{"$f":"'Org structure'!A14","v":"Vote 13 - "},null,{"$f":"'C3C'!C112","v":0},{"$f":"'C3C'!D112","v":0},{"$f":"'C3C'!E112","v":0},{"$f":"'C3C'!F112","v":0},{"$f":"'C3C'!G112","v":0},{"$f":"'C3C'!H112","v":0},0,{"$f":"IF(I36=0,\"\",I36/H36)","v":""},{"$f":"'C3C'!K112","v":0}]
[{"$f":"'Org structure'!A15","v":"Vote 14 - "},null,{"$f":"'C3C'!C113","v":0},{"$f":"'C3C'!D113","v":0},{"$f":"'C3C'!E113","v":0},{"$f":"'C3C'!F113","v":0},{"$f":"'C3C'!G113","v":0},{"$f":"'C3C'!H113","v":0},0,{"$f":"IF(I37=0,\"\",I37/H37)","v":""},{"$f":"'C3C'!K113","v":0}]
[{"$f":"'Org structure'!A16","v":"Vote 15 - Other"},null,{"$f":"'C3C'!C114","v":0},{"$f":"'C3C'!D114","v":0},{"$f":"'C3C'!E114","v":0},{"$f":"'C3C'!F114","v":0},{"$f":"'C3C'!G114","v":0},{"$f":"'C3C'!H114","v":0},0,"",{"$f":"'C3C'!K114","v":0}]
["Total Expenditure by Vote",2,{"$f":"SUM(C24:C38)","v":308994214.94},{"$f":"SUM(D24:D38)","v":285311044},293502989,-8435070.6999999993,178523591.00999999,217262767.08999997,-38739176.079999991,{"$f":"IF(I39=0,\"\",I39/H39)","v":-0.17830563698911414},{"$f":"SUM(K24:K38)","v":293502989}]
[{"$f":"result","v":"Surplus/ (Deficit) for the year"},2,{"$f":"C21-C39","v":4669259.1699999571},64396511,58276998,59811926.820000008,104187410.55000001,45846707.710000038,{"$f":"I21-I39","v":58340702.840000011},{"$f":"IF(I40=0,\"\",I40/H40)","v":1.2725167357497034},{"$f":"K21-K39","v":58276998}]
[{"$f":"head27a","v":"References"}]
["1. Insert 'Vote'; e.g. Department, if different to standard classification structure"]
["2. Must reconcile to Monthly Budget Statement - Financial Performance Statement (standard classification)"]

{"sheet":"C3C","index":10,"n_rows":124,"n_cols":23,"rows_kept":124,"cut":false,"hidden":false,"merged":[[1,11,1,22],[1,3,1,10]]}
[{"$f":"muni& \" - \"&S71C& \" - \"&\"A\"& \" - \"&date","v":"LIM353 Molemole - Table C3 Monthly Budget Statement - Financial Performance (revenue and expenditure by municipal vote) - A - Q3 Third Quarter"}]
[{"$f":"Vdesc","v":"Vote Description"},{"$f":"head27","v":"Ref"},{"$f":"Head1","v":"2024/25"},{"$f":"Head2","v":"Budget Year 2025/26"},null,null,null,null,null,null,null,{"$f":"Head4","v":{"$error":"#NAME?"}}]
["R thousand",null,{"$f":"Head5","v":"Audited Outcome"},{"$f":"Head6","v":"Original Budget"},{"$f":"Head7","v":"Adjusted Budget"},{"$f":"Head38","v":"Monthly actual"},{"$f":"Head39","v":"YearTD actual"},{"$f":"Head40","v":"YearTD budget"},{"$f":"Head41","v":"YTD variance"},{"$f":"Head41","v":"YTD variance"},{"$f":"Head8","v":"Full Year Forecast"},{"$f":"Head12","v":"Forecast 2010/11"},{"$f":"Head13","v":"Forecast 2011/12"},{"$f":"Head14","v":"Forecast 2012/13"},{"$f":"Head15","v":"Forecast 2013/14"},{"$f":"Head16","v":"Forecast 2014/15"},{"$f":"Head17","v":"Forecast 2015/16"},{"$f":"Head18","v":"Forecast 2016/17"},{"$f":"Head19","v":"Forecast 2017/18"},{"$f":"Head20","v":"Forecast 2018/19"},{"$f":"Head21","v":"Forecast 2019/20"},{"$f":"Head22","v":"Forecast 2020/21"},{"$f":"Head23","v":"Forecast 2021/22"}]
[null,null,null,null,null,null,null,null,null,"%"]
["Revenue by Vote",1]
[{"$f":"'Org structure'!A2","v":"Vote 01 - Corporate Services"},null,{"$f":"SUM(C7:C14)","v":1957820.13},3916995,5643355,1820612.59,2828942.56,3628270,{"$f":"G6-H6","v":-799327.44},{"$f":"IF(I6=0,\"\",I6/H6)","v":-0.22030539072340261},{"$f":"SUM(K7:K14)","v":5643355}]
[{"$f":"'Org structure'!E3","v":"01.1 - Corporate Services Admin"},null,421141.31,421629,672329,1739661.1,1739661.1,416495,{"$f":"G7-H7","v":1323166.1000000001},{"$f":"IF(I7=0,\"\",I7/H7)","v":3.1769075259006714},672329]
[{"$f":"'Org structure'!E4","v":"01.2 - Human Resources"},null,201121.51,251724,827384,74040.38,494212.18,419057,75155.179999999993,0.17934357378590501,827384]
[{"$f":"'Org structure'!E5","v":"01.3 - Information Technology Services"},null,770042.12,0,900000,0,563440.72,360000,203440.71999999997,0.56511311111111107,900000]
[{"$f":"'Org structure'!E6","v":"01.4 - Council Support"},null,6000,0,0,0,0,0,0,"",0]
[{"$f":"'Org structure'!E7","v":"01.5 - Local Economic Development"},null,94835.76,2117445,2117445,0,4800,1588077,-1583277,-0.99697747653293889,2117445]
[{"$f":"'Org structure'!E8","v":"01.6 - Municipal Planning Idp"},null,0,0,0,0,0,0,0,"",0]
[{"$f":"'Org structure'!E9","v":"01.7 - Town & Regional Planning"},null,464679.43,1126197,1126197,6911.11,26828.560000000001,844641,-817812.44,-0.96823673016109801,1126197]
[{"$f":"'Org structure'!E10","v":"01.8 - Led Administration"},null,0,0,0,0,0,0,0,"",0]
[{"$f":"'Org structure'!A3","v":"Vote 02 - Municipal Manager"},null,{"$f":"SUM(C16:C20)","v":0},0,60000,0,36083.279999999999,24000,12083.279999999999,0.50346999999999997,{"$f":"SUM(K16:K20)","v":60000}]
[{"$f":"'Org structure'!E12","v":"02.1 - Municipal Manager Admin"},null,0,0,0,0,0,0,{"$f":"G16-H16","v":0},{"$f":"IF(I16=0,\"\",I16/H16)","v":""},0]
[{"$f":"'Org structure'!E13","v":"02.2 - Legal Services"},null,0,0,0,0,0,0,{"$f":"G17-H17","v":0},{"$f":"IF(I17=0,\"\",I17/H17)","v":""},0]
[{"$f":"'Org structure'!E14","v":"02.3 - Political Office Beares"},null,0,0,0,0,0,0,{"$f":"G18-H18","v":0},{"$f":"IF(I18=0,\"\",I18/H18)","v":""},0]
[{"$f":"'Org structure'!E15","v":"02.4 - Pms"},null,0,0,0,0,0,0,{"$f":"G19-H19","v":0},{"$f":"IF(I19=0,\"\",I19/H19)","v":""},0]
[{"$f":"'Org structure'!E16","v":"02.5 - Internal Audit"},null,0,0,60000,0,36083.279999999999,24000,{"$f":"G20-H20","v":12083.279999999999},{"$f":"IF(I20=0,\"\",I20/H20)","v":0.50346999999999997},60000]
[{"$f":"'Org structure'!A4","v":"Vote 03 - Mayors Office"},null,{"$f":"SUM(C22:C26)","v":0},0,0,0,0,0,0,"",{"$f":"SUM(K22:K26)","v":0}]
[{"$f":"'Org structure'!E18","v":"03.1 - Mayors Office Admin"},null,0,0,0,0,0,0,{"$f":"G22-H22","v":0},{"$f":"IF(I22=0,\"\",I22/H22)","v":""},0]
[{"$f":"'Org structure'!E19","v":"03.2 - Office Of The Speaker"},null,0,0,0,0,0,0,{"$f":"G23-H23","v":0},{"$f":"IF(I23=0,\"\",I23/H23)","v":""},0]
[{"$f":"'Org structure'!E20","v":"03.3 - Office Of The Chief Whip"},null,0,0,0,0,0,0,{"$f":"G24-H24","v":0},{"$f":"IF(I24=0,\"\",I24/H24)","v":""},0]
[{"$f":"'Org structure'!E21","v":"03.4 - Exco Members"},null,0,0,0,0,0,0,{"$f":"G25-H25","v":0},{"$f":"IF(I25=0,\"\",I25/H25)","v":""},0]
[{"$f":"'Org structure'!E22","v":"03.5 - Council General Administration"},null,0,0,0,0,0,0,{"$f":"G26-H26","v":0},{"$f":"IF(I26=0,\"\",I26/H26)","v":""},0]
[{"$f":"'Org structure'!A5","v":"Vote 04 - Budget And Treasury"},null,{"$f":"SUM(C28:C33)","v":234446353.75},246675245,245715245,47516057.479999997,224784832.77000001,184622367,40162465.770000011,0.21753846201094373,{"$f":"SUM(K28:K33)","v":245715245}]
[{"$f":"'Org structure'!E24","v":"04.1 - Budget And Treasury Admin"},null,220331367.09,229885722,228685722,47512159.609999999,218309691.44999999,171934233,{"$f":"G28-H28","v":46375458.449999988},{"$f":"IF(I28=0,\"\",I28/H28)","v":0.26972789328114771},228685722]
[{"$f":"'Org structure'!E25","v":"04.2 - Chief Financial Officer Admin"},null,0,0,0,0,0,0,0,"",0]
[{"$f":"'Org structure'!E26","v":"04.3 - Budget & Reporting"},null,13918817.93,16695504,16755504,0,6338070.7999999998,12545628,-6207557.2000000002,-0.49479844293167308,16755504]
[{"$f":"'Org structure'!E27","v":"04.4 - Revenue Management"},null,196168.73,94019,154019,3897.87,65953.960000000006,94506,-28552.039999999994,-0.30211880727149593,154019]
[{"$f":"'Org structure'!E28","v":"04.5 - Supply Chain Management"},null,0,0,60000,0,35258.28,24000,11258.279999999999,0.46909499999999993,60000]
[{"$f":"'Org structure'!E29","v":"04.6 - Expenditure"},null,0,0,60000,0,35858.28,24000,11858.279999999999,0.49409499999999995,60000]
[{"$f":"'Org structure'!A6","v":"Vote 05 - Community Services"},null,{"$f":"SUM(C35:C40)","v":8503612.7000000011},15320718,15320718,1030455.5599999999,10959466.060000001,11490498,-531031.93999999948,-4.6214875978395319E-2,{"$f":"SUM(K35:K40)","v":15320718}]
[{"$f":"'Org structure'!E31","v":"05.1 - Community Services Admin"},null,1385014,1405000,0,0,0,491747,{"$f":"G35-H35","v":-491747},{"$f":"IF(I35=0,\"\",I35/H35)","v":-1},0]
[{"$f":"'Org structure'!E32","v":"05.2 - Libraries"},null,0,0,0,0,0,0,0,"",0]
[{"$f":"'Org structure'!E33","v":"05.3 - Sports Recreation & Social Amenitie"},null,233209.67,332,332,19345.87,328879.75,243,328636.75,1352.414609053498,332]
[{"$f":"'Org structure'!E34","v":"05.4 - Traffic Service"},null,5130894.9400000004,12479469,12479469,848182.96,8287723.6200000001,9359586,-1071862.3799999999,-0.11452027685839949,12479469]
[{"$f":"'Org structure'!E35","v":"05.5 - Parks; Cemeteries"},null,17850,0,0,1980,5940,0,5940,{"$error":"#DIV/0!"},0]
[{"$f":"'Org structure'!E36","v":"05.6 - Refuse"},null,1736644.09,1435917,2840917,160946.73000000001,2336922.69,1638922,698000.69,0.42589012167754164,2840917]
[{"$f":"'Org structure'!A7","v":"Vote 06 - Technical Services"},null,{"$f":"SUM(C42:C49)","v":68755687.529999986},83794597,85040669,1009730.49,44101676.890000001,63344339.799999997,-19242662.909999996,-0.3037787270457904,{"$f":"SUM(K42:K49)","v":85040669}]
[{"$f":"'Org structure'!E38","v":"06.1 - Mpac"},null,0,0,0,0,0,0,{"$f":"G42-H42","v":0},{"$f":"IF(I42=0,\"\",I42/H42)","v":""},0]
[{"$f":"'Org structure'!E39","v":"06.2 - Technical Services Admin"},null,0,0,0,0,0,0,0,"",0]
[{"$f":"'Org structure'!E40","v":"06.3 - Techn Serv-Roads: Admin"},null,0,0,0,0,21485888.949999999,0,21485888.949999999,{"$error":"#DIV/0!"},0]
[{"$f":"'Org structure'!E41","v":"06.4 - Techn Serv-Stormwater: Admin"},null,0,0,0,0,1737623.7,0,1737623.7,{"$error":"#DIV/0!"},0]
[{"$f":"'Org structure'!E42","v":"06.5 - Project Management Unit"},null,39472412.369999997,52929000,52929000,0,132718.39000000001,39696741,-39564022.609999999,-0.99665669305195603,52929000]
[{"$f":"'Org structure'!E43","v":"06.6 - Electrical & Machinery"},null,29076343.920000002,30352837,31598909,1009730.49,20526767.920000002,23263037.800000001,-2736269.879999999,-0.11762306812741365,31598909]
[{"$f":"'Org structure'!E44","v":"06.7 - Water"},null,206931.24,146962,146962,0,69795.58,110214,-40418.42,-0.36672673163119024,146962]
[{"$f":"'Org structure'!E45","v":"06.8 - Sanitation"},null,0,365798,365798,0,148882.35,274347,-125464.65,-0.45732102045949108,365798]
[{"$f":"'Org structure'!A8","v":"Vote 07 - "},null,0,0,0,0,0,0,{"$f":"G50-H50","v":0},{"$f":"IF(I50=0,\"\",I50/H50)","v":""},0]
[{"$f":"'Org structure'!A9","v":"Vote 08 - "},null,0,0,0,0,0,0,0,"",0]
[{"$f":"'Org structure'!A10","v":"Vote 09 - "},null,0,0,0,0,0,0,0,"",0]
[{"$f":"'Org structure'!A11","v":"Vote 10 - "},null,0,0,0,0,0,0,0,"",0]
[{"$f":"'Org structure'!A12","v":"Vote 11 - "},null,0,0,0,0,0,0,0,"",0]
[{"$f":"'Org structure'!A13","v":"Vote 12 - "},null,0,0,0,0,0,0,0,"",0]
[{"$f":"'Org structure'!A14","v":"Vote 13 - "},null,0,0,0,0,0,0,{"$f":"G56-H56","v":0},{"$f":"IF(I56=0,\"\",I56/H56)","v":""},0]
[{"$f":"'Org structure'!A15","v":"Vote 14 - "},null,0,0,0,0,0,0,0,"",0]
[{"$f":"'Org structure'!A16","v":"Vote 15 - Other"},null,0,0,0,0,0,0,0,"",0]
["Total Revenue by Vote",2,{"$f":"C6+C15+C21+C27+C34+C41+C50+C51+C52+C53+C54+C55+C56+C57+C58","v":313663474.10999995},349707555,351779987,51376856.120000005,282711001.56,263109474.80000001,19601526.75999999,7.4499509281829898E-2,{"$f":"K6+K15+K21+K27+K34+K41+K50+K51+K52+K53+K54+K55+K56+K57+K58","v":351779987}]
[null,null,null,null,null,null,null,null,0,""]
["Expenditure by Vote",1,null,null,null,null,null,null,0,""]
[{"$f":"'Org structure'!A2","v":"Vote 01 - Corporate Services"},null,{"$f":"SUM(C63:C70)","v":63325473.25},67364632,67641759,1521487.4600000002,38952484.199999996,50809915.829999998,-11857431.630000003,-0.2333684564578426,{"$f":"SUM(K63:K70)","v":67641759}]
[{"$f":"'Org structure'!E3","v":"01.1 - Corporate Services Admin"},null,28437059.870000001,29234613,28026716,548077.67000000004,17909263.739999998,21477938.170000002,{"$f":"G63-H63","v":-3568674.4300000034},{"$f":"IF(I63=0,\"\",I63/H63)","v":-0.16615535447367399},28026716]
[{"$f":"'Org structure'!E4","v":"01.2 - Human Resources"},null,6645175.6299999999,6929696,7742103,32271.15,5116105.4400000004,5802345.7400000002,-686240.29999999981,-0.11826946044756026,7742103]
[{"$f":"'Org structure'!E5","v":"01.3 - Information Technology Services"},null,11098915.300000001,10037286,10213017,653915.56000000006,5835187.0800000001,7493342.4000000004,-1658155.3200000003,-0.22128380520820726,10213017]
[{"$f":"'Org structure'!E6","v":"01.4 - Council Support"},null,5709736.79,7657441,9323193,59000,4270611.2,6409461.7999999998,-2138850.5999999996,-0.33370205904027694,9323193]
[{"$f":"'Org structure'!E7","v":"01.5 - Local Economic Development"},null,4868658.3600000003,5943210,5961629,0,3100455.96,4447369.66,-1346913.7000000002,-0.30285625054158422,5961629]
[{"$f":"'Org structure'!E8","v":"01.6 - Municipal Planning Idp"},null,3709782.72,3971219,2847409,228223.08,669760.53,2528909,-1859148.47,-0.73515831135086318,2847409]
[{"$f":"'Org structure'!E9","v":"01.7 - Town & Regional Planning"},null,2213264.52,2791167,2727692,0,2051100.25,2050546.06,554.18999999994412,2.7026459478795813E-4,2727692]
[{"$f":"'Org structure'!E10","v":"01.8 - Led Administration"},null,642880.06000000006,800000,800000,0,0,600003,-600003,-1,800000]
[{"$f":"'Org structure'!A3","v":"Vote 02 - Municipal Manager"},null,{"$f":"SUM(C72:C76)","v":27104286.359999999},28230775,30662622,114550.98,20448478.950000003,22111228.829999998,-1662749.8799999952,-7.5199342957548113E-2,{"$f":"SUM(K72:K76)","v":30662622}]
[{"$f":"'Org structure'!E12","v":"02.1 - Municipal Manager Admin"},null,7677906.6399999997,7326820,8113656,75962.5,5509388.04,5902704.3700000001,{"$f":"G72-H72","v":-393316.33000000007},{"$f":"IF(I72=0,\"\",I72/H72)","v":-6.6633242213348404E-2},8113656]
[{"$f":"'Org structure'!E13","v":"02.2 - Legal Services"},null,4790514.5599999996,3812174,5034773,15972.48,2627961.4900000002,3348240.6,{"$f":"G73-H73","v":-720279.10999999987},{"$f":"IF(I73=0,\"\",I73/H73)","v":-0.21512167016910311},5034773]
[{"$f":"'Org structure'!E14","v":"02.3 - Political Office Beares"},null,614412.74,995097,1014578,22616,566307.68000000005,754189.4,{"$f":"G74-H74","v":-187881.71999999997},{"$f":"IF(I74=0,\"\",I74/H74)","v":-0.24911742328916311},1014578]
[{"$f":"'Org structure'!E15","v":"02.4 - Pms"},null,3273963.14,3907949,3734947,0,2217813.84,2861847.2,{"$f":"G75-H75","v":-644033.36000000034},{"$f":"IF(I75=0,\"\",I75/H75)","v":-0.22504114126009253},3734947]
[{"$f":"'Org structure'!E16","v":"02.5 - Internal Audit"},null,10747489.279999999,12188735,12764668,0,9527007.9000000004,9244247.2599999998,{"$f":"G76-H76","v":282760.6400000006},{"$f":"IF(I76=0,\"\",I76/H76)","v":3.0587740899522479E-2},12764668]
[{"$f":"'Org structure'!A4","v":"Vote 03 - Mayors Office"},null,{"$f":"SUM(C78:C82)","v":17205165.640000001},20443276,20345171,76302.45,11571156.6,15293410,-3722253.4000000004,-0.24338936836192845,{"$f":"SUM(K78:K82)","v":20345171}]
[{"$f":"'Org structure'!E18","v":"03.1 - Mayors Office Admin"},null,3447553.92,4013381,4063381,20596.45,2490191.7799999998,3030140,{"$f":"G78-H78","v":-539948.2200000002},{"$f":"IF(I78=0,\"\",I78/H78)","v":-0.17819249935646544},4063381]
[{"$f":"'Org structure'!E19","v":"03.2 - Office Of The Speaker"},null,914118.34,1202523,1054418,21819.8,623456.5,842675,{"$f":"G79-H79","v":-219218.5},{"$f":"IF(I79=0,\"\",I79/H79)","v":-0.26014596374640281},1054418]
[{"$f":"'Org structure'!E20","v":"03.3 - Office Of The Chief Whip"},null,510963.84,835529,835529,6972.1,369377.19,626670,{"$f":"G80-H80","v":-257292.81},{"$f":"IF(I80=0,\"\",I80/H80)","v":-0.41057144908803678},835529]
[{"$f":"'Org structure'!E21","v":"03.4 - Exco Members"},null,3749556.79,4769770,4769770,26914.1,2447465.66,3577347,{"$f":"G81-H81","v":-1129881.3399999999},{"$f":"IF(I81=0,\"\",I81/H81)","v":-0.31584337219732944},4769770]
[{"$f":"'Org structure'!E22","v":"03.5 - Council General Administration"},null,8582972.75,9622073,9622073,0,5640665.4699999997,7216578,{"$f":"G82-H82","v":-1575912.5300000003},{"$f":"IF(I82=0,\"\",I82/H82)","v":-0.21837393429406574},9622073]
[{"$f":"'Org structure'!A5","v":"Vote 04 - Budget And Treasury"},null,{"$f":"SUM(C84:C89)","v":64583665.669999994},40970823,45706992,1480364.85,38502573,32483014.629999999,{"$f":"G83-H83","v":6019558.370000001},{"$f":"IF(I83=0,\"\",I83/H83)","v":0.18531403068853652},{"$f":"SUM(K84:K89)","v":45706992}]
[{"$f":"'Org structure'!E24","v":"04.1 - Budget And Treasury Admin"},null,37494759.810000002,8017376,7850376,555597.46,17105991.460000001,5771316.0599999996,{"$f":"G84-H84","v":11334675.400000002},{"$f":"IF(I84=0,\"\",I84/H84)","v":1.9639671926059796},7850376]
[{"$f":"'Org structure'!E25","v":"04.2 - Chief Financial Officer Admin"},null,50361.29,0,0,0,686.1,0,686.1,{"$error":"#DIV/0!"},0]
[{"$f":"'Org structure'!E26","v":"04.3 - Budget & Reporting"},null,5419887.7800000003,9789249,8058839,0,5341650.68,6684855.9699999997,-1343205.29,-0.20093256998026243,8058839]
[{"$f":"'Org structure'!E27","v":"04.4 - Revenue Management"},null,8506039.5899999999,9537351,15212045,519878.1,6530118.7000000002,9422978.5999999996,-2892859.8999999994,-0.30700058047462819,15212045]
[{"$f":"'Org structure'!E28","v":"04.5 - Supply Chain Management"},null,7638783.6600000001,8165791,8487781,400904.35,5532149.1699999999,6253215,-721065.83000000007,-0.11531121671012433,8487781]
[{"$f":"'Org structure'!E29","v":"04.6 - Expenditure"},null,5473833.54,5461056,6097951,3984.94,3991976.89,4350649,-358672.10999999987,-8.2441058793756947E-2,6097951]
[{"$f":"'Org structure'!A6","v":"Vote 05 - Community Services"},null,{"$f":"SUM(C91:C96)","v":41798936.960000001},43980610,41951878,127280.08,29240625.729999997,32165506.199999999,-2924880.4700000025,-9.0932207060991393E-2,{"$f":"SUM(K91:K96)","v":41951878}]
[{"$f":"'Org structure'!E31","v":"05.1 - Community Services Admin"},null,3123116.27,6893499,6177211,0,2159651.9,4883759.8,{"$f":"G91-H91","v":-2724107.9},{"$f":"IF(I91=0,\"\",I91/H91)","v":-0.55778908291108009},6177211]
[{"$f":"'Org structure'!E32","v":"05.2 - Libraries"},null,1789621.22,1918760,2009283,0,1150282.19,1475354.2,-325072.01,-0.22033489313955931,2009283]
[{"$f":"'Org structure'!E33","v":"05.3 - Sports Recreation & Social Amenitie"},null,3591191.65,3484575,3628560,1814.78,1877842.81,2662113,-784270.19,-0.29460439508014874,3628560]
[{"$f":"'Org structure'!E34","v":"05.4 - Traffic Service"},null,22125481.559999999,18954986,18794986,38062.14,15367676.5,14152337,1215339.5,8.587553419622497E-2,18794986]
[{"$f":"'Org structure'!E35","v":"05.5 - Parks; Cemeteries"},null,995673.82,1398787,1369340,0,660352.54,1037360.2,-377007.65999999992,-0.36342984818580848,1369340]
[{"$f":"'Org structure'!E36","v":"05.6 - Refuse"},null,10173852.439999999,11330003,9972498,87403.16,8024819.79,7954582,70237.790000000037,8.8298530331323549E-3,9972498]
[{"$f":"'Org structure'!A7","v":"Vote 06 - Technical Services"},null,{"$f":"SUM(C98:C105)","v":94976687.060000002},84320928,87194567,-11755056.52,39808272.530000001,64399691.599999994,-24591419.069999993,-0.38185616202547151,{"$f":"SUM(K98:K105)","v":87194567}]
[{"$f":"'Org structure'!E38","v":"06.1 - Mpac"},null,1724964.49,2289896,2298556,259723.6,1227503.05,1720925,{"$f":"G98-H98","v":-493421.94999999995},{"$f":"IF(I98=0,\"\",I98/H98)","v":-0.28671903191597542},2298556]
[{"$f":"'Org structure'!E39","v":"06.2 - Technical Services Admin"},null,159595.96,0,0,0,61143.47,0,61143.47,{"$error":"#DIV/0!"},0]
[{"$f":"'Org structure'!E40","v":"06.3 - Techn Serv-Roads: Admin"},null,10767642.960000001,7360204,7200204,303616,4011161.97,5465195,-1454033.0299999998,-0.26605327531771505,7200204]
[{"$f":"'Org structure'!E41","v":"06.4 - Techn Serv-Stormwater: Admin"},null,23250273.100000001,18152215,18862326,4316.6000000000004,10747672.029999999,13898317.4,-3150645.370000001,-0.22669257575021282,18862326]
[{"$f":"'Org structure'!E42","v":"06.5 - Project Management Unit"},null,3210617.38,3475071,3292783,8517.43,1898232.68,2533475.7999999998,-635243.11999999988,-0.25073976234547019,3292783]
[{"$f":"'Org structure'!E43","v":"06.6 - Electrical & Machinery"},null,48511487.390000001,46298999,47947380,-12331230.15,17237687.809999999,35383755.399999999,-18146067.59,-0.51283611320690969,47947380]
[{"$f":"'Org structure'!E44","v":"06.7 - Water"},null,7217372.5499999998,6631392,7480167,0,4624871.5199999996,5313144,-688272.48000000045,-0.12954146923177698,7480167]
[{"$f":"'Org structure'!E45","v":"06.8 - Sanitation"},null,134733.23000000001,113151,113151,0,0,84879,-84879,-1,113151]
[{"$f":"'Org structure'!A8","v":"Vote 07 - "},null,0,0,0,0,0,0,0,"",0]
[{"$f":"'Org structure'!A9","v":"Vote 08 - "},null,0,0,0,0,0,0,0,"",0]
[{"$f":"'Org structure'!A10","v":"Vote 09 - "},null,0,0,0,0,0,0,{"$f":"G108-H108","v":0},{"$f":"IF(I108=0,\"\",I108/H108)","v":""},0]
[{"$f":"'Org structure'!A11","v":"Vote 10 - "},null,0,0,0,0,0,0,0,"",0]
[{"$f":"'Org structure'!A12","v":"Vote 11 - "},null,0,0,0,0,0,0,0,"",0]
[{"$f":"'Org structure'!A13","v":"Vote 12 - "},null,0,0,0,0,0,0,0,"",0]
[{"$f":"'Org structure'!A14","v":"Vote 13 - "},null,0,0,0,0,0,0,0,"",0]
[{"$f":"'Org structure'!A15","v":"Vote 14 - "},null,0,0,0,0,0,0,0,"",0]
[{"$f":"'Org structure'!A16","v":"Vote 15 - Other"},null,0,0,0,0,0,0,{"$f":"G114-H114","v":0},{"$f":"IF(I114=0,\"\",I114/H114)","v":""},0]
["Total Expenditure by Vote",2,{"$f":"C62+C71+C77+C83+C90+C97+C106+C107+C108+C109+C110+C111+C112+C113+C114","v":308994214.94},285311044,293502989,-8435070.6999999993,178523591.00999999,217262767.08999997,-38739176.079999983,-0.17830563698911411,{"$f":"K62+K71+K77+K83+K90+K97+K106+K107+K108+K109+K110+K111+K112+K113+K114","v":293502989}]
[null,null,null,null,null,null,null,null,0,"",null,{"$f":"#REF!-#REF!","v":{"$error":"#REF!"}},{"$f":"#REF!-#REF!","v":{"$error":"#REF!"}},{"$f":"#REF!-#REF!","v":{"$error":"#REF!"}},{"$f":"#REF!-#REF!","v":{"$error":"#REF!"}},{"$f":"#REF!-#REF!","v":{"$error":"#REF!"}},{"$f":"#REF!-#REF!","v":{"$error":"#REF!"}},{"$f":"#REF!-#REF!","v":{"$error":"#REF!"}},{"$f":"#REF!-#REF!","v":{"$error":"#REF!"}},{"$f":"#REF!-#REF!","v":{"$error":"#REF!"}},{"$f":"#REF!-#REF!","v":{"$error":"#REF!"}},{"$f":"#REF!-#REF!","v":{"$error":"#REF!"}},{"$f":"#REF!-#REF!","v":{"$error":"#REF!"}}]
[{"$f":"result","v":"Surplus/ (Deficit) for the year"},2,{"$f":"C59-C115","v":4669259.1699999571},64396511,58276998,59811926.820000008,104187410.55000001,45846707.710000038,58340702.839999974,1.2725167357497027,{"$f":"K59-K115","v":58276998}]
[{"$f":"head27a","v":"References"}]
["1. Insert 'Vote'; e.g. Department, if different to standard structure"]
["2. Must reconcile to Financial Performance ('Revenue and Expenditure by Standard Classification' and 'Revenue and Expenditure')"]
["3. Assign share in 'associate' to relevant Vote"]
[]
["check revenue"]
["check expenditure"]

{"sheet":"C4-FinPerf RE","index":11,"n_rows":66,"n_cols":11,"rows_kept":66,"cut":false,"hidden":false,"merged":[[0,0,0,10],[1,0,2,0],[1,1,2,1],[1,3,1,10]]}
[{"$f":"muni& \" - \"&S71B& \" - \"&date","v":"LIM353 Molemole - Table C4 Monthly Budget Statement - Financial Performance (revenue and expenditure) - Q3 Third Quarter"}]
[{"$f":"desc","v":"Description"},{"$f":"head27","v":"Ref"},{"$f":"Head1","v":"2024/25"},{"$f":"Head2","v":"Budget Year 2025/26"}]
[null,null,{"$f":"Head5","v":"Audited Outcome"},{"$f":"Head6","v":"Original Budget"},{"$f":"Head7","v":"Adjusted Budget"},{"$f":"Head38","v":"Monthly actual"},{"$f":"Head39","v":"YearTD actual"},{"$f":"Head40","v":"YearTD budget"},{"$f":"Head41","v":"YTD variance"},{"$f":"Head41","v":"YTD variance"},{"$f":"Head8","v":"Full Year Forecast"}]
["R thousands",null,null,null,null,null,null,null,null,"%"]
["Revenue"]
["Exchange Revenue"]
["Service charges - Electricity ",null,12003878.24,14201434,14201434,995041.75,9226504.7799999993,10651068,{"$f":"G7-H7","v":-1424563.2200000007},{"$f":"IF(I7=0,\"\",I7/H7)","v":-0.1337483921800143},14201434]
["Service charges - Water ",null,0,0,0,0,18.329999999999998,0,18.329999999999998,{"$error":"#DIV/0!"},0]
["Service charges - Waste Water Management",null,0,0,0,0,0,0,0,"",0]
["Service charges - Waste management",null,1297723.1499999999,984870,984870,117574.85,1015014.14,738639,276375.14,0.37416808481545116,984870]
["Sale of Goods and Rendering of Services",null,17376644.510000002,1308158,18525230,1748552.21,1772429.66,7867927.7999999998,-6095498.1399999997,-0.77472725919015162,18525230]
["Agency services",null,206931.24,512760,512760,0,218659.6,384561,-165901.4,-0.43140464061618311,512760]
["Interest",null,null,null,null,null,null,null,0,""]
["Interest earned from Receivables",null,693046.84,725469,725469,60915.01,504618.07,544086,-39467.929999999993,-7.2539874211062214E-2,725469]
["Interest from Current and Non Current Assets",null,13918817.93,16695504,16695504,0,6303375.0199999996,12521628,-6218252.9800000004,-0.49660099948664826,16695504]
["Dividends",null,0,0,0,0,0,0,0,"",0]
["Rent on Land",null,0,0,0,0,0,0,0,"",0]
["Rental from Fixed Assets",null,231134.22,240000,490700,18998.04,177764.97,280280,-102515.03,-0.36575934779506208,490700]
["Licence and permits",null,4501380.7,14449976,14449976,844982.96,8269578.5599999996,10837467,-2567888.4400000004,-0.23694544490885189,14449976]
["Special rating levies",null,null,null,null,null,null,null,0,""]
["Operational Revenue",null,0,0,0,0,0,0,0,"",0]
["Non-Exchange Revenue",null,null,null,null,null,null,null,0,""]
["Property rates",null,29864220.670000002,39267857,39267857,661872.22,29540247.329999998,29450844,89403.329999998212,3.0356797244927248E-3,39267857]
["Surcharges and Taxes",null,null,null,null,null,null,null,0,""]
["Fines, penalties and forfeits",null,733275.06,146938,146938,4591.3100000000004,32546.799999999999,110196,-77649.2,-0.70464626665214702,146938]
["Licence and permits",null,null,null,null,null,null,null,0,""]
["Transfers and subsidies - Operational",null,193141465.66,207339000,191368000,46731000,200773124.77000001,149115832,51657292.770000011,0.34642393149776352,191368000]
["Interest",null,734380.46,1495865,1495865,119287.39,1009394.7,1121895,-112500.30000000005,-0.10027703127298013,1495865]
["Fuel Levy",null,null,null,null,null,null,null,0,""]
["Operational Revenue",null,null,null,null,null,null,null,0,""]
["Gains on disposal of Assets",null,770042.12,0,0,0,0,0,0,"",0]
["Other Gains",null,6000,0,0,0,0,0,0,"",0]
["Discontinued Operations",null,null,null,null,null,null,null,0,""]
["Total Revenue (excluding capital transfers and contributions)",null,{"$f":"SUM(C7:C21)+SUM(C23:C33)","v":275478940.80000001},297367831,298864603,51302815.740000002,258843276.72999999,223624423.80000001,{"$f":"G34-H34","v":35218852.929999977},0.1574910840754058,{"$f":"SUM(K7:K21)+SUM(K23:K33)","v":298864603}]
["Expenditure By Type"]
["Employee related costs",null,118552192.41,121240320,126130876,0,82373611.269999996,92888208.400000006,{"$f":"G36-H36","v":-10514597.13000001},{"$f":"IF(I36=0,\"\",I36/H36)","v":-0.11319625290565954},126130876]
["Remuneration of councillors",null,14185585.140000001,16413901,16265796,0,9476685.8399999999,12251273,-2774587.16,-0.22647337627689793,16265796]
["Bulk purchases - electricity",null,16015294.01,15182813,15572008,985761.16,10867964.470000001,11542793,-674828.52999999933,-5.8463192573928971E-2,15572008]
["Inventory consumed",null,5238701.6399999997,6410611,5710611,513380.31,3999972.43,4527989,-528016.56999999983,-0.11661171659206765,5710611]
["Debt impairment",null,27252364.210000001,2359253,2359253,0,1198803.46,1769463,-570659.54,-0.32250436431844015,2359253]
["Depreciation and amortisation",null,24411644.82,21656256,24133195,0,23709323.530000001,17233282.600000001,6476040.9299999997,0.37578684690054343,24133195]
["Interest",null,2935813.16,2551065,3085365,0,8689.52,2127030,-2118340.48,-0.99591471676469068,3085365]
["Contracted services",null,62567021.520000003,61204750,60628701,-11420741.75,19695946.16,45673288.399999999,-25977342.239999998,-0.56876443869104021,60628701]
["Transfers and subsidies",null,0,0,0,0,0,0,0,"",0]
["Irrecoverable debts written off",null,247789.67,547578,547578,179253.86,646396.26,410688,235708.26,0.57393510402057035,547578]
["Operational costs",null,33577418.450000003,37744497,39069606,1307275.72,26546198.07,28838751.690000001,-2292553.620000001,-7.9495591371070221E-2,39069606]
["Losses on Disposal of Assets",null,2656645.91,0,0,0,0,0,0,"",0]
["Other Losses",null,1353744,0,0,0,0,0,0,"",0]
["Total Expenditure",null,{"$f":"SUM(C36:C48)","v":308994214.94},285311044,293502989,-8435070.6999999993,178523591.00999999,217262767.09,{"$f":"G49-H49","v":-38739176.080000013},-0.17830563698911422,{"$f":"SUM(K36:K48)","v":293502989}]
["Surplus/(Deficit)",null,{"$f":"C34-C49","v":-33515274.139999986},12056787,5361614,59737886.439999998,80319685.719999999,{"$f":"H34-H49","v":6361656.7100000083},{"$f":"I34-I49","v":73958029.00999999},11.625592574610945,{"$f":"K34-K49","v":5361614}]
["Transfers and subsidies - capital (monetary allocations)",null,37448726.670000002,52088000,52088000,0,23373512.649999999,39065994,{"$f":"G51-H51","v":-15692481.350000001},-0.40169159269312338,52088000]
["Transfers and subsidies - capital (in-kind)",null,0,0,0,0,0,0,{"$f":"G52-H52","v":0},"",0]
["Surplus/(Deficit) after capital transfers & contributions",null,{"$f":"C50+SUM(C51:C52)","v":3933452.5300000161},64144787,57449614,59737886.439999998,103693198.37,45427650.710000008,{"$f":"G53-H53","v":58265547.659999996},1.2826009434640206,{"$f":"K50+SUM(K51:K52)","v":57449614}]
["Income Tax",null,null,null,null,null,null,null,{"$f":"G54-H54","v":0},""]
["Surplus/(Deficit) after income tax",null,{"$f":"C53-C54","v":3933452.5300000161},64144787,57449614,59737886.439999998,103693198.37,45427650.710000008,58265547.659999996,1.2826009434640206,{"$f":"K53-K54","v":57449614}]
["Share of Surplus/Deficit attributable to Joint Venture",null,null,null,null,null,null,null,0,""]
["Share of Surplus/Deficit attributable to Minorities",null,null,null,null,null,null,null,0,""]
["Surplus/(Deficit) attributable to municipality",null,{"$f":"SUM(C55:C57)","v":3933452.5300000161},64144787,57449614,59737886.439999998,103693198.37,45427650.710000008,58265547.659999996,1.2826009434640206,{"$f":"SUM(K55:K57)","v":57449614}]
["Share of Surplus/Deficit attributable to Associate",null,null,null,null,null,null,null,0,""]
["Intercompany/Parent subsidiary transactions",null,null,null,null,null,null,null,0,""]
["Surplus/ (Deficit) for the year",null,{"$f":"SUM(C58:C60)","v":3933452.5300000161},64144787,57449614,59737886.439999998,103693198.37,45427650.710000008,58265547.659999996,1.2826009434640206,{"$f":"SUM(K58:K60)","v":57449614}]
[{"$f":"head27a","v":"References"}]
["1. Material variances to be explained on Table SC1"]
[]
[]
[{"$f":"A34&\" including capital transfers/contributions etc\"","v":"Total Revenue (excluding capital transfers and contributions) including capital transfers/contributions etc"},null,{"$f":"C34+SUM(C51:C52)","v":312927667.47000003},349455831,350952603,51302815.740000002,282216789.38,262690417.80000001,null,null,{"$f":"K34+SUM(K51:K52)","v":350952603}]

{"sheet":"C5-Capex","index":12,"n_rows":86,"n_cols":11,"rows_kept":86,"cut":false,"hidden":false,"merged":[[0,0,0,10],[76,0,76,10],[78,0,78,10],[77,0,77,10],[1,0,2,0],[1,1,2,1]]}
[{"$f":"muni& \" - \"&S71D& \" - \"&date","v":"LIM353 Molemole - Table C5 Monthly Budget Statement - Capital Expenditure (municipal vote, functional classification and funding) - Q3 Third Quarter"}]
[{"$f":"Vdesc","v":"Vote Description"},{"$f":"head27","v":"Ref"},{"$f":"Head1","v":"2024/25"},{"$f":"Head2","v":"Budget Year 2025/26"}]
[null,null,{"$f":"Head5","v":"Audited Outcome"},{"$f":"Head6","v":"Original Budget"},{"$f":"Head7","v":"Adjusted Budget"},{"$f":"Head38","v":"Monthly actual"},{"$f":"Head39","v":"YearTD actual"},{"$f":"Head40","v":"YearTD budget"},{"$f":"Head41","v":"YTD variance"},{"$f":"Head41","v":"YTD variance"},{"$f":"Head8","v":"Full Year Forecast"}]
["R thousands",1,null,null,null,null,null,null,null,"%"]
["Multi-Year expenditure appropriation",2]
[{"$f":"'Org structure'!A2","v":"Vote 01 - Corporate Services"},null,{"$f":"'C5C'!C7","v":2579651.29},{"$f":"'C5C'!D7","v":4300000},{"$f":"'C5C'!E7","v":2479000},{"$f":"'C5C'!F7","v":0},{"$f":"'C5C'!G7","v":53860},{"$f":"'C5C'!H7","v":2496606},{"$f":"G6-H6","v":-2442746},{"$f":"IF(I6=0,\"\",I6/H6)","v":-0.97842671210435284},{"$f":"'C5C'!K7","v":2479000}]
[{"$f":"'Org structure'!A3","v":"Vote 02 - Municipal Manager"},null,{"$f":"'C5C'!C11","v":147826.09},{"$f":"'C5C'!D11","v":150000},{"$f":"'C5C'!E11","v":150000},{"$f":"'C5C'!F11","v":-22616},{"$f":"'C5C'!G11","v":115200},{"$f":"'C5C'!H11","v":112500},2700,2.4E-2,{"$f":"'C5C'!K11","v":150000}]
[{"$f":"'Org structure'!A4","v":"Vote 03 - Mayors Office"},null,{"$f":"'C5C'!C14","v":0},{"$f":"'C5C'!D14","v":0},{"$f":"'C5C'!E14","v":0},{"$f":"'C5C'!F14","v":0},{"$f":"'C5C'!G14","v":0},{"$f":"'C5C'!H14","v":0},0,"",{"$f":"'C5C'!K14","v":0}]
[{"$f":"'Org structure'!A5","v":"Vote 04 - Budget And Treasury"},null,{"$f":"'C5C'!C15","v":2976569.26},{"$f":"'C5C'!D15","v":0},{"$f":"'C5C'!E15","v":0},{"$f":"'C5C'!F15","v":0},{"$f":"'C5C'!G15","v":0},{"$f":"'C5C'!H15","v":0},0,"",{"$f":"'C5C'!K15","v":0}]
[{"$f":"'Org structure'!A6","v":"Vote 05 - Community Services"},null,{"$f":"'C5C'!C19","v":1779570.5},{"$f":"'C5C'!D19","v":13758800},{"$f":"'C5C'!E19","v":12760000},{"$f":"'C5C'!F19","v":0},{"$f":"'C5C'!G19","v":619184.78},{"$f":"'C5C'!H19","v":9919601},-9300416.2200000007,-0.93757966877901644,{"$f":"'C5C'!K19","v":12760000}]
[{"$f":"'Org structure'!A7","v":"Vote 06 - Technical Services"},null,{"$f":"'C5C'!C23","v":45339009.649999999},{"$f":"'C5C'!D23","v":46188000},{"$f":"'C5C'!E23","v":42888000},{"$f":"'C5C'!F23","v":14128351.5},{"$f":"'C5C'!G23","v":34028316.539999999},{"$f":"'C5C'!H23","v":33321018},707298.53999999911,2.1226798653030322E-2,{"$f":"'C5C'!K23","v":42888000}]
[{"$f":"'Org structure'!A8","v":"Vote 07 - "},null,{"$f":"'C5C'!C28","v":0},{"$f":"'C5C'!D28","v":0},{"$f":"'C5C'!E28","v":0},{"$f":"'C5C'!F28","v":0},{"$f":"'C5C'!G28","v":0},{"$f":"'C5C'!H28","v":0},{"$f":"G12-H12","v":0},{"$f":"IF(I12=0,\"\",I12/H12)","v":""},{"$f":"'C5C'!K28","v":0}]
[{"$f":"'Org structure'!A9","v":"Vote 08 - "},null,{"$f":"'C5C'!C29","v":0},{"$f":"'C5C'!D29","v":0},{"$f":"'C5C'!E29","v":0},{"$f":"'C5C'!F29","v":0},{"$f":"'C5C'!G29","v":0},{"$f":"'C5C'!H29","v":0},0,"",{"$f":"'C5C'!K29","v":0}]
[{"$f":"'Org structure'!A10","v":"Vote 09 - "},null,{"$f":"'C5C'!C30","v":0},{"$f":"'C5C'!D30","v":0},{"$f":"'C5C'!E30","v":0},{"$f":"'C5C'!F30","v":0},{"$f":"'C5C'!G30","v":0},{"$f":"'C5C'!H30","v":0},0,"",{"$f":"'C5C'!K30","v":0}]
[{"$f":"'Org structure'!A11","v":"Vote 10 - "},null,{"$f":"'C5C'!C31","v":0},{"$f":"'C5C'!D31","v":0},{"$f":"'C5C'!E31","v":0},{"$f":"'C5C'!F31","v":0},{"$f":"'C5C'!G31","v":0},{"$f":"'C5C'!H31","v":0},0,"",{"$f":"'C5C'!K31","v":0}]
[{"$f":"'Org structure'!A12","v":"Vote 11 - "},null,{"$f":"'C5C'!C32","v":0},{"$f":"'C5C'!D32","v":0},{"$f":"'C5C'!E32","v":0},{"$f":"'C5C'!F32","v":0},{"$f":"'C5C'!G32","v":0},{"$f":"'C5C'!H32","v":0},0,"",{"$f":"'C5C'!K32","v":0}]
[{"$f":"'Org structure'!A13","v":"Vote 12 - "},null,{"$f":"'C5C'!C33","v":0},{"$f":"'C5C'!D33","v":0},{"$f":"'C5C'!E33","v":0},{"$f":"'C5C'!F33","v":0},{"$f":"'C5C'!G33","v":0},{"$f":"'C5C'!H33","v":0},0,"",{"$f":"'C5C'!K33","v":0}]
[{"$f":"'Org structure'!A14","v":"Vote 13 - "},null,{"$f":"'C5C'!C34","v":0},{"$f":"'C5C'!D34","v":0},{"$f":"'C5C'!E34","v":0},{"$f":"'C5C'!F34","v":0},{"$f":"'C5C'!G34","v":0},{"$f":"'C5C'!H34","v":0},{"$f":"G18-H18","v":0},{"$f":"IF(I18=0,\"\",I18/H18)","v":""},{"$f":"'C5C'!K34","v":0}]
[{"$f":"'Org structure'!A15","v":"Vote 14 - "},null,{"$f":"'C5C'!C35","v":0},{"$f":"'C5C'!D35","v":0},{"$f":"'C5C'!E35","v":0},{"$f":"'C5C'!F35","v":0},{"$f":"'C5C'!G35","v":0},{"$f":"'C5C'!H35","v":0},{"$f":"G19-H19","v":0},{"$f":"IF(I19=0,\"\",I19/H19)","v":""},{"$f":"'C5C'!K35","v":0}]
[{"$f":"'Org structure'!A16","v":"Vote 15 - Other"},null,{"$f":"'C5C'!C36","v":0},{"$f":"'C5C'!D36","v":0},{"$f":"'C5C'!E36","v":0},{"$f":"'C5C'!F36","v":0},{"$f":"'C5C'!G36","v":0},{"$f":"'C5C'!H36","v":0},{"$f":"G20-H20","v":0},{"$f":"IF(I20=0,\"\",I20/H20)","v":""},{"$f":"'C5C'!K36","v":0}]
["Total Capital Multi-year expenditure","4,7",{"$f":"SUM(C6:C20)","v":52822626.789999999},{"$f":"SUM(D6:D20)","v":64396800},58277000,14105735.5,34816561.32,45849725,-11033163.680000002,{"$f":"IF(I21=0,\"\",I21/H21)","v":-0.24063751047579895},{"$f":"SUM(K6:K20)","v":58277000}]
[]
["Single Year expenditure appropriation",2]
[{"$f":"'C5C'!A41","v":"Vote 01 - Corporate Services"},null,{"$f":"'C5C'!C41","v":0},{"$f":"'C5C'!D41","v":0},{"$f":"'C5C'!E41","v":0},{"$f":"'C5C'!F41","v":0},{"$f":"'C5C'!G41","v":0},{"$f":"'C5C'!H41","v":0},{"$f":"G24-H24","v":0},{"$f":"IF(I24=0,\"\",I24/H24)","v":""},{"$f":"'C5C'!K41","v":0}]
[{"$f":"'C5C'!A42","v":"Vote 02 - Municipal Manager"},null,{"$f":"'C5C'!C42","v":0},{"$f":"'C5C'!D42","v":0},{"$f":"'C5C'!E42","v":0},{"$f":"'C5C'!F42","v":0},{"$f":"'C5C'!G42","v":0},{"$f":"'C5C'!H42","v":0},0,"",{"$f":"'C5C'!K42","v":0}]
[{"$f":"'C5C'!A43","v":"Vote 03 - Mayors Office"},null,{"$f":"'C5C'!C43","v":0},{"$f":"'C5C'!D43","v":0},{"$f":"'C5C'!E43","v":0},{"$f":"'C5C'!F43","v":0},{"$f":"'C5C'!G43","v":0},{"$f":"'C5C'!H43","v":0},0,"",{"$f":"'C5C'!K43","v":0}]
[{"$f":"'C5C'!A44","v":"Vote 04 - Budget And Treasury"},null,{"$f":"'C5C'!C44","v":0},{"$f":"'C5C'!D44","v":0},{"$f":"'C5C'!E44","v":0},{"$f":"'C5C'!F44","v":0},{"$f":"'C5C'!G44","v":0},{"$f":"'C5C'!H44","v":0},0,"",{"$f":"'C5C'!K44","v":0}]
[{"$f":"'C5C'!A45","v":"Vote 05 - Community Services"},null,{"$f":"'C5C'!C45","v":0},{"$f":"'C5C'!D45","v":0},{"$f":"'C5C'!E45","v":0},{"$f":"'C5C'!F45","v":0},{"$f":"'C5C'!G45","v":0},{"$f":"'C5C'!H45","v":0},0,"",{"$f":"'C5C'!K45","v":0}]
[{"$f":"'C5C'!A46","v":"Vote 06 - Technical Services"},null,{"$f":"'C5C'!C46","v":0},{"$f":"'C5C'!D46","v":0},{"$f":"'C5C'!E46","v":0},{"$f":"'C5C'!F46","v":0},{"$f":"'C5C'!G46","v":0},{"$f":"'C5C'!H46","v":0},0,"",{"$f":"'C5C'!K46","v":0}]
[{"$f":"'Org structure'!A8","v":"Vote 07 - "},null,{"$f":"'C5C'!C47","v":0},{"$f":"'C5C'!D47","v":0},{"$f":"'C5C'!E47","v":0},{"$f":"'C5C'!F47","v":0},{"$f":"'C5C'!G47","v":0},{"$f":"'C5C'!H47","v":0},{"$f":"'C5C'!I47","v":0},{"$f":"IF(I30=0,\"\",I30/H30)","v":""},{"$f":"'C5C'!K47","v":0}]
[{"$f":"'Org structure'!A9","v":"Vote 08 - "},null,{"$f":"'C5C'!C48","v":0},{"$f":"'C5C'!D48","v":0},{"$f":"'C5C'!E48","v":0},{"$f":"'C5C'!F48","v":0},{"$f":"'C5C'!G48","v":0},{"$f":"'C5C'!H48","v":0},{"$f":"'C5C'!I48","v":0},"",{"$f":"'C5C'!K48","v":0}]
[{"$f":"'Org structure'!A10","v":"Vote 09 - "},null,{"$f":"'C5C'!C49","v":0},{"$f":"'C5C'!D49","v":0},{"$f":"'C5C'!E49","v":0},{"$f":"'C5C'!F49","v":0},{"$f":"'C5C'!G49","v":0},{"$f":"'C5C'!H49","v":0},{"$f":"'C5C'!I49","v":0},"",{"$f":"'C5C'!K49","v":0}]
[{"$f":"'Org structure'!A11","v":"Vote 10 - "},null,{"$f":"'C5C'!C50","v":0},{"$f":"'C5C'!D50","v":0},{"$f":"'C5C'!E50","v":0},{"$f":"'C5C'!F50","v":0},{"$f":"'C5C'!G50","v":0},{"$f":"'C5C'!H50","v":0},{"$f":"'C5C'!I50","v":0},"",{"$f":"'C5C'!K50","v":0}]
[{"$f":"'Org structure'!A12","v":"Vote 11 - "},null,{"$f":"'C5C'!C51","v":0},{"$f":"'C5C'!D51","v":0},{"$f":"'C5C'!E51","v":0},{"$f":"'C5C'!F51","v":0},{"$f":"'C5C'!G51","v":0},{"$f":"'C5C'!H51","v":0},{"$f":"'C5C'!I51","v":0},"",{"$f":"'C5C'!K51","v":0}]
[{"$f":"'Org structure'!A13","v":"Vote 12 - "},null,{"$f":"'C5C'!C52","v":0},{"$f":"'C5C'!D52","v":0},{"$f":"'C5C'!E52","v":0},{"$f":"'C5C'!F52","v":0},{"$f":"'C5C'!G52","v":0},{"$f":"'C5C'!H52","v":0},{"$f":"'C5C'!I52","v":0},"",{"$f":"'C5C'!K52","v":0}]
[{"$f":"'Org structure'!A14","v":"Vote 13 - "},null,{"$f":"'C5C'!C53","v":0},{"$f":"'C5C'!D53","v":0},{"$f":"'C5C'!E53","v":0},{"$f":"'C5C'!F53","v":0},{"$f":"'C5C'!G53","v":0},{"$f":"'C5C'!H53","v":0},{"$f":"'C5C'!I53","v":0},"",{"$f":"'C5C'!K53","v":0}]
[{"$f":"'Org structure'!A15","v":"Vote 14 - "},null,{"$f":"'C5C'!C54","v":0},{"$f":"'C5C'!D54","v":0},{"$f":"'C5C'!E54","v":0},{"$f":"'C5C'!F54","v":0},{"$f":"'C5C'!G54","v":0},{"$f":"'C5C'!H54","v":0},{"$f":"'C5C'!I54","v":0},"",{"$f":"'C5C'!K54","v":0}]
[{"$f":"'Org structure'!A16","v":"Vote 15 - Other"},null,{"$f":"'C5C'!C55","v":0},{"$f":"'C5C'!D55","v":0},{"$f":"'C5C'!E55","v":0},{"$f":"'C5C'!F55","v":0},{"$f":"'C5C'!G55","v":0},{"$f":"'C5C'!H55","v":0},{"$f":"'C5C'!I55","v":0},"",{"$f":"'C5C'!K55","v":0}]
["Total Capital single-year expenditure",4,{"$f":"SUM(C24:C38)","v":0},0,0,0,0,0,0,"",{"$f":"SUM(K24:K38)","v":0}]
["Total Capital Expenditure",null,{"$f":"C39+C21","v":52822626.789999999},64396800,58277000,14105735.5,34816561.32,45849725,-11033163.680000002,{"$f":"IF(I40=0,\"\",I40/H40)","v":-0.24063751047579895},{"$f":"K39+K21","v":58277000}]
[]
["Capital Expenditure - Functional Classification"]
["Governance and administration",null,{"$f":"SUM(C44:C46)","v":5530046.6399999997},4450000,2629000,-22616,169060,2609106,{"$f":"G43-H43","v":-2440046},{"$f":"IF(I43=0,\"\",I43/H43)","v":-0.93520385909963033},{"$f":"SUM(K44:K46)","v":2629000}]
["Executive and council",null,0,0,0,0,0,0,0,{"$f":"IF(I44=0,\"\",I44/H44)","v":""},0]
["Finance and administration",null,5530046.6399999997,4450000,2629000,-22616,169060,2609106,-2440046,-0.93520385909963033,2629000]
["Internal audit",null,0,0,0,0,0,0,0,"",0]
["Community and public safety",null,{"$f":"SUM(C48:C52)","v":1779570.5},13758800,12760000,0,619184.78,9919601,-9300416.2200000007,-0.93757966877901644,{"$f":"SUM(K48:K52)","v":12760000}]
["Community and social services",null,1758370.5,1000000,500000,0,488750,550006,-61256,-0.11137333047275848,500000]
["Sport and recreation",null,0,12758800,12200000,0,130434.78,9345595,-9215160.2200000007,-0.98604318077126185,12200000]
["Public safety",null,21200,0,60000,0,0,24000,-24000,-1,60000]
["Housing",null,null,null,null,null,null,null,0,""]
["Health",null,null,null,null,null,null,null,0,""]
["Economic and environmental services",null,{"$f":"SUM(C54:C56)","v":19689235.030000001},23303670,39340826,341851.5,18899664.289999999,23892628.399999999,-4992964.1099999994,-0.20897508747928292,{"$f":"SUM(K54:K56)","v":39340826}]
["Planning and development",null,174000,0,300000,0,0,120000,-120000,-1,300000]
["Road transport",null,19515235.030000001,23303670,39040826,341851.5,18899664.289999999,23772628.399999999,-4872964.1099999994,-0.20498213441135518,39040826]
["Environmental protection",null,null,null,null,null,null,null,0,""]
["Trading services",null,{"$f":"SUM(C58:C61)","v":25823774.619999997},22884330,3547174,13786500,15128652.25,9428389.5999999996,5700262.6500000004,0.6045849706931925,{"$f":"SUM(K58:K61)","v":3547174}]
["Energy sources",null,2691899.49,3800000,200000,13786500,13786500,1410003,12376497,8.7776387709813388,200000]
["Water management",null,null,null,null,null,null,null,0,""]
["Waste water management",null,23131875.129999999,19084330,3347174,0,1342152.25,8018386.5999999996,-6676234.3499999996,-0.83261567233488087,3347174]
["Waste management",null,null,null,null,null,null,null,0,""]
["Other",null,null,null,null,null,null,null,0,""]
["Total Capital Expenditure - Functional Classification",3,{"$f":"C43+C47+C53+C57+C62","v":52822626.789999999},{"$f":"D43+D47+D53+D57+D62","v":64396800},58277000,14105735.5,34816561.32,45849725,-11033163.68,-0.24063751047579893,{"$f":"K43+K47+K53+K57+K62","v":58277000}]
[]
["Funded by:"]
["National Government",null,32564110.16,52088000,52388000,14128351.5,34158751.32,39186012,{"$f":"G66-H66","v":-5027260.68},{"$f":"IF(I66=0,\"\",I66/H66)","v":-0.12829222529712897},52388000]
["Provincial Government",null,0,0,0,0,0,0,0,"",0]
["District Municipality",null,0,0,0,0,0,0,0,"",0]
["Transfers and subsidies - capital (monetary allocations) (Nat / Prov Departm Agencies, Households, Non-profit Institutions, Private Enterprises, Public Corporatons, Higher Educ Institutions)",null,0,0,0,0,0,0,0,"",0]
["Transfers recognised - capital",null,{"$f":"SUM(C66:C69)","v":32564110.16},52088000,52388000,14128351.5,34158751.32,39186012,-5027260.68,-0.12829222529712897,{"$f":"SUM(K66:K69)","v":52388000}]
[]
["Borrowing",6,null,null,null,null,null,null,0,""]
["Internally generated funds",null,20258516.629999999,12308800,5889000,-22616,657810,6663713,-6005903,-0.90128476421478532,5889000]
["Total Capital Funding",null,{"$f":"+C70+C72+C73","v":52822626.789999999},64396800,58277000,14105735.5,34816561.32,45849725,-11033163.68,-0.24063751047579893,{"$f":"+K70+K72+K73","v":58277000}]
[{"$f":"head27a","v":"References"}]
["1. Municipalities may choose to appropriate for capital expenditure for three years or for one year (if one year appropriation projected expenditure required for yr2 and yr3)."]
["2. Include capital component of PPP unitary payment"]
["3. Capital expenditure by functional classification must reconcile to the total of multi-year and single year appropriations"]
["4. Include expenditure on investment property, intangible and biological assets"]
[]
["6. Include finance leases and PPP capital funding component of unitary payment - total borrowing/repayments to reconcile to changes in Table SA17"]
["7. Total Capital Funding must balance with Total Capital Expenditure"]
[]
[]
[]
["check balance",null,{"$f":"C40-C74","v":0},{"$f":"D40-D74","v":0},0,0,0,0,null,null,0]

{"sheet":"C5C","index":13,"n_rows":59,"n_cols":23,"rows_kept":59,"cut":false,"hidden":false,"merged":[[1,3,1,10],[1,11,1,22],[0,0,0,10]]}
[{"$f":"muni& \" - \"&S71D& \" - \"&\"A\"& \" - \"&date","v":"LIM353 Molemole - Table C5 Monthly Budget Statement - Capital Expenditure (municipal vote, functional classification and funding) - A - Q3 Third Quarter"}]
[{"$f":"Vdesc","v":"Vote Description"},{"$f":"head27","v":"Ref"},{"$f":"Head1","v":"2024/25"},{"$f":"Head2","v":"Budget Year 2025/26"},null,null,null,null,null,null,null,{"$f":"Head4","v":{"$error":"#NAME?"}}]
["R thousand",null,{"$f":"Head5","v":"Audited Outcome"},{"$f":"Head6","v":"Original Budget"},{"$f":"Head7","v":"Adjusted Budget"},{"$f":"Head38","v":"Monthly actual"},{"$f":"Head39","v":"YearTD actual"},{"$f":"Head40","v":"YearTD budget"},{"$f":"Head41","v":"YTD variance"},{"$f":"Head41","v":"YTD variance"},{"$f":"Head8","v":"Full Year Forecast"},{"$f":"Head12","v":"Forecast 2010/11"},{"$f":"Head13","v":"Forecast 2011/12"},{"$f":"Head14","v":"Forecast 2012/13"},{"$f":"Head15","v":"Forecast 2013/14"},{"$f":"Head16","v":"Forecast 2014/15"},{"$f":"Head17","v":"Forecast 2015/16"},{"$f":"Head18","v":"Forecast 2016/17"},{"$f":"Head19","v":"Forecast 2017/18"},{"$f":"Head20","v":"Forecast 2018/19"},{"$f":"Head21","v":"Forecast 2019/20"},{"$f":"Head22","v":"Forecast 2020/21"},{"$f":"Head23","v":"Forecast 2021/22"}]
[null,null,null,null,null,null,null,null,null,"%"]
["Capital expenditure - Municipal Vote"]
["Expenditure of multi-year capital appropriation",1]
[{"$f":"'Org structure'!A2","v":"Vote 01 - Corporate Services"},null,{"$f":"SUM(C8:C10)","v":2579651.29},4300000,2479000,0,53860,2496606,{"$f":"G7-H7","v":-2442746},{"$f":"IF(I7=0,\"\",I7/H7)","v":-0.97842671210435284},{"$f":"SUM(K8:K10)","v":2479000}]
[{"$f":"'Org structure'!E3","v":"01.1 - Corporate Services Admin"},null,325786.28999999998,3700000,2350000,0,24860,2235006,{"$f":"G8-H8","v":-2210146},{"$f":"IF(I8=0,\"\",I8/H8)","v":-0.98887698735484375},2350000]
[{"$f":"'Org structure'!E5","v":"01.3 - Information Technology Services"},null,2079865,600000,129000,0,29000,261600,{"$f":"G9-H9","v":-232600},{"$f":"IF(I9=0,\"\",I9/H9)","v":-0.88914373088685017},129000]
[{"$f":"'Org structure'!E8","v":"01.6 - Municipal Planning Idp"},null,174000,0,0,0,0,0,{"$f":"G10-H10","v":0},{"$f":"IF(I10=0,\"\",I10/H10)","v":""},0]
[{"$f":"'Org structure'!A3","v":"Vote 02 - Municipal Manager"},null,{"$f":"SUM(C12:C13)","v":147826.09},150000,150000,-22616,115200,112500,2700,2.4E-2,{"$f":"SUM(K12:K13)","v":150000}]
[{"$f":"'Org structure'!E14","v":"02.3 - Political Office Beares"},null,147826.09,150000,150000,-22616,115200,112500,{"$f":"G12-H12","v":2700},{"$f":"IF(I12=0,\"\",I12/H12)","v":2.4E-2},150000]
[{"$f":"'Org structure'!E16","v":"02.5 - Internal Audit"},null,0,0,0,0,0,0,{"$f":"G13-H13","v":0},{"$f":"IF(I13=0,\"\",I13/H13)","v":""},0]
[{"$f":"'Org structure'!A4","v":"Vote 03 - Mayors Office"},null,0,0,0,0,0,0,0,"",0]
[{"$f":"'Org structure'!A5","v":"Vote 04 - Budget And Treasury"},null,{"$f":"SUM(C16:C18)","v":2976569.26},0,0,0,0,0,0,"",{"$f":"SUM(K16:K18)","v":0}]
[{"$f":"'Org structure'!E24","v":"04.1 - Budget And Treasury Admin"},null,0,0,0,0,0,0,{"$f":"G16-H16","v":0},{"$f":"IF(I16=0,\"\",I16/H16)","v":""},0]
[{"$f":"'Org structure'!E27","v":"04.4 - Revenue Management"},null,2976569.26,0,0,0,0,0,{"$f":"G17-H17","v":0},{"$f":"IF(I17=0,\"\",I17/H17)","v":""},0]
[{"$f":"'Org structure'!E28","v":"04.5 - Supply Chain Management"},null,0,0,0,0,0,0,{"$f":"G18-H18","v":0},{"$f":"IF(I18=0,\"\",I18/H18)","v":""},0]
[{"$f":"'Org structure'!A6","v":"Vote 05 - Community Services"},null,{"$f":"SUM(C20:C22)","v":1779570.5},13758800,12760000,0,619184.78,9919601,-9300416.2200000007,-0.93757966877901644,{"$f":"SUM(K20:K22)","v":12760000}]
[{"$f":"'Org structure'!E31","v":"05.1 - Community Services Admin"},null,1758370.5,1000000,500000,0,488750,550006,{"$f":"G20-H20","v":-61256},{"$f":"IF(I20=0,\"\",I20/H20)","v":-0.11137333047275848},500000]
[{"$f":"'Org structure'!E33","v":"05.3 - Sports Recreation & Social Amenitie"},null,0,12758800,12200000,0,130434.78,9345595,{"$f":"G21-H21","v":-9215160.2200000007},{"$f":"IF(I21=0,\"\",I21/H21)","v":-0.98604318077126185},12200000]
[{"$f":"'Org structure'!E34","v":"05.4 - Traffic Service"},null,21200,0,60000,0,0,24000,{"$f":"G22-H22","v":-24000},{"$f":"IF(I22=0,\"\",I22/H22)","v":-1},60000]
[{"$f":"'Org structure'!A7","v":"Vote 06 - Technical Services"},null,{"$f":"SUM(C24:C27)","v":45339009.649999999},46188000,42888000,14128351.5,34028316.539999999,33321018,707298.53999999911,2.1226798653030322E-2,{"$f":"SUM(K24:K27)","v":42888000}]
[{"$f":"'Org structure'!E40","v":"06.3 - Techn Serv-Roads: Admin"},null,19515235.030000001,23303670,39040826,341851.5,18899664.289999999,23772628.399999999,{"$f":"G24-H24","v":-4872964.1099999994},{"$f":"IF(I24=0,\"\",I24/H24)","v":-0.20498213441135518},39040826]
[{"$f":"'Org structure'!E41","v":"06.4 - Techn Serv-Stormwater: Admin"},null,23131875.129999999,19084330,3347174,0,1342152.25,8018386.5999999996,{"$f":"G25-H25","v":-6676234.3499999996},{"$f":"IF(I25=0,\"\",I25/H25)","v":-0.83261567233488087},3347174]
[{"$f":"'Org structure'!E42","v":"06.5 - Project Management Unit"},null,0,0,300000,0,0,120000,{"$f":"G26-H26","v":-120000},{"$f":"IF(I26=0,\"\",I26/H26)","v":-1},300000]
[{"$f":"'Org structure'!E43","v":"06.6 - Electrical & Machinery"},null,2691899.49,3800000,200000,13786500,13786500,1410003,{"$f":"G27-H27","v":12376497},{"$f":"IF(I27=0,\"\",I27/H27)","v":8.7776387709813388},200000]
[{"$f":"'Org structure'!A8","v":"Vote 07 - "},null,0,0,0,0,0,0,{"$f":"G28-H28","v":0},{"$f":"IF(I28=0,\"\",I28/H28)","v":""},0]
[{"$f":"'Org structure'!A9","v":"Vote 08 - "},null,0,0,0,0,0,0,0,"",0]
[{"$f":"'Org structure'!A10","v":"Vote 09 - "},null,0,0,0,0,0,0,0,"",0]
[{"$f":"'Org structure'!A11","v":"Vote 10 - "},null,0,0,0,0,0,0,0,"",0]
[{"$f":"'Org structure'!A12","v":"Vote 11 - "},null,0,0,0,0,0,0,0,"",0]
[{"$f":"'Org structure'!A13","v":"Vote 12 - "},null,0,0,0,0,0,0,0,"",0]
[{"$f":"'Org structure'!A14","v":"Vote 13 - "},null,0,0,0,0,0,0,{"$f":"G34-H34","v":0},{"$f":"IF(I34=0,\"\",I34/H34)","v":""},0]
[{"$f":"'Org structure'!A15","v":"Vote 14 - "},null,0,0,0,0,0,0,0,"",0]
[{"$f":"'Org structure'!A16","v":"Vote 15 - Other"},null,0,0,0,0,0,0,0,"",0]
["Total multi-year capital expenditure",null,{"$f":"C7+C11+C14+C15+C19+C23+C28+C29+C30+C31+C32+C33+C34+C35+C36","v":52822626.789999999},64396800,58277000,14105735.5,34816561.32,45849725,-11033163.68,-0.24063751047579893,{"$f":"K7+K11+K14+K15+K19+K23+K28+K29+K30+K31+K32+K33+K34+K35+K36","v":58277000}]
[null,null,null,null,null,null,null,null,0,""]
["Capital expenditure - Municipal Vote"]
["Expenditue of single-year capital appropriation",1]
[{"$f":"'Org structure'!A2","v":"Vote 01 - Corporate Services"},null,0,0,0,0,0,0,0,"",0]
[{"$f":"'Org structure'!A3","v":"Vote 02 - Municipal Manager"},null,0,0,0,0,0,0,0,"",0]
[{"$f":"'Org structure'!A4","v":"Vote 03 - Mayors Office"},null,0,0,0,0,0,0,0,"",0]
[{"$f":"'Org structure'!A5","v":"Vote 04 - Budget And Treasury"},null,0,0,0,0,0,0,{"$f":"G44-H44","v":0},{"$f":"IF(I44=0,\"\",I44/H44)","v":""},0]
[{"$f":"'Org structure'!A6","v":"Vote 05 - Community Services"},null,0,0,0,0,0,0,0,"",0]
[{"$f":"'Org structure'!A7","v":"Vote 06 - Technical Services"},null,0,0,0,0,0,0,0,"",0]
[{"$f":"'Org structure'!A8","v":"Vote 07 - "},null,0,0,0,0,0,0,0,"",0]
[{"$f":"'Org structure'!A9","v":"Vote 08 - "},null,0,0,0,0,0,0,0,"",0]
[{"$f":"'Org structure'!A10","v":"Vote 09 - "},null,0,0,0,0,0,0,{"$f":"G49-H49","v":0},{"$f":"IF(I49=0,\"\",I49/H49)","v":""},0]
[{"$f":"'Org structure'!A11","v":"Vote 10 - "},null,0,0,0,0,0,0,0,"",0]
[{"$f":"'Org structure'!A12","v":"Vote 11 - "},null,0,0,0,0,0,0,0,"",0]
[{"$f":"'Org structure'!A13","v":"Vote 12 - "},null,0,0,0,0,0,0,0,"",0]
[{"$f":"'Org structure'!A14","v":"Vote 13 - "},null,0,0,0,0,0,0,0,"",0]
[{"$f":"'Org structure'!A15","v":"Vote 14 - "},null,0,0,0,0,0,0,0,"",0]
[{"$f":"'Org structure'!A16","v":"Vote 15 - Other"},null,0,0,0,0,0,0,{"$f":"G55-H55","v":0},{"$f":"IF(I55=0,\"\",I55/H55)","v":""},0]
["Total single-year capital expenditure",null,{"$f":"C41+C42+C43+C44+C45+C46+C47+C48+C49+C50+C51+C52+C53+C54+C55","v":0},0,0,0,0,0,0,"",{"$f":"K41+K42+K43+K44+K45+K46+K47+K48+K49+K50+K51+K52+K53+K54+K55","v":0}]
["Total Capital Expenditure",null,{"$f":"C37+C56","v":52822626.789999999},64396800,58277000,14105735.5,34816561.32,45849725,-11033163.68,-0.24063751047579893,{"$f":"K37+K56","v":58277000}]
[{"$f":"head27a","v":"References"}]
["1. Insert 'Vote'; e.g. Department, if different to standard structure"]

{"sheet":"C6-FinPos","index":14,"n_rows":57,"n_cols":7,"rows_kept":57,"cut":false,"hidden":false,"merged":[[1,0,2,0],[1,1,2,1],[52,0,52,6],[0,0,0,6]]}
[{"$f":"muni& \" - \"&S71E& \" - \"&date","v":"LIM353 Molemole - Table C6 Monthly Budget Statement - Financial Position - Q3 Third Quarter"}]
[{"$f":"desc","v":"Description"},{"$f":"head27","v":"Ref"},{"$f":"Head1","v":"2024/25"},{"$f":"Head2","v":"Budget Year 2025/26"}]
[null,null,{"$f":"Head5","v":"Audited Outcome"},{"$f":"Head6","v":"Original Budget"},{"$f":"Head7","v":"Adjusted Budget"},{"$f":"Head39","v":"YearTD actual"},{"$f":"Head8","v":"Full Year Forecast"}]
["R thousands",1]
["ASSETS"]
["Current assets"]
["Cash and cash equivalents",null,132645118.40000001,129572538,135907981,136822834.66,135907981]
["Trade and other receivables from exchange transactions",null,410695.47999999952,5606550,280976,-953145.35999999894,280976]
["Receivables from non-exchange transactions",null,2801392.3300000075,80962794,15097710,-402624.79000001214,15097710]
["Current portion of non-current receivables",null,0,0,0,0,0]
["Inventory",null,362727.19000000006,156003,362728,362727.19,362728]
["VAT",null,-47245555.729999997,6481927,10460714,-52295756.490000002,10460714]
["Other current assets",null,5139576.74,2257473,-644423,8724274.9900000002,-644423]
["Total current assets",null,{"$f":"SUM(C7:C13)","v":94113954.410000011},{"$f":"SUM(D7:D13)","v":225037285},{"$f":"SUM(E7:E13)","v":161465686},{"$f":"SUM(F7:F13)","v":92258310.199999973},{"$f":"SUM(G7:G13)","v":161465686}]
["Non current assets"]
["Investments",null,0,0,0,0,0]
["Investment property",null,1534541.53,1459246,1534540,1512711.73,1534540]
["Property, plant and equipment",null,453538074.32000005,483709061,512293401,477996453.42999995,512293401]
["Biological assets"]
["Living and non-living resources"]
["Heritage assets",null,414500,408500,414500,414500,414500]
["Intangible assets",null,3277274.97,315044,3277272,3222109.93,3277272]
["Trade and other receivables from exchange transactions"]
["Non-current receivables from non-exchange transactions",null,0,0,0,0,0]
["Other non-current assets"]
["Total non current assets",null,{"$f":"SUM(C16:C25)","v":458764390.82000005},{"$f":"SUM(D16:D25)","v":485891851},{"$f":"SUM(E16:E25)","v":517519713},{"$f":"SUM(F16:F25)","v":483145775.08999997},{"$f":"SUM(G16:G25)","v":517519713}]
["TOTAL ASSETS",null,{"$f":"C14+C26","v":552878345.23000002},{"$f":"D14+D26","v":710929136},{"$f":"E14+E26","v":678985399},{"$f":"F14+F26","v":575404085.28999996},{"$f":"G14+G26","v":678985399}]
["LIABILITIES"]
["Current liabilities"]
["Bank overdraft",null,0,0,0,0,0]
["Financial liabilities",null,0,0,0,0,0]
["Consumer deposits",null,507776.48,509126,507777,507776.48,507777]
["Trade and other payables from exchange transactions",null,40080584.310000002,42369912,45684645,-75726226.150000006,45684645]
["Trade and other payables from non-exchange transactions",null,1409931.21,1260124,1409930,47085900.789999999,1409930]
["Provision",null,2532199.94,-835329,3094285,2493166.34,3094285]
["VAT",null,-50200253.43,0,7506016,-52331559.640000001,7506016]
["Other current liabilities",null,0,0,0,0,0]
["Total current liabilities",null,{"$f":"SUM(C30:C37)","v":-5669761.4900000021},{"$f":"SUM(D30:D37)","v":43303833},{"$f":"SUM(E30:E37)","v":58202653},{"$f":"SUM(F30:F37)","v":-77970942.180000007},{"$f":"SUM(G30:G37)","v":58202653}]
["Non current liabilities"]
["Financial liabilities",null,0,0,0,0,0]
["Provision",null,59790949.839999996,58128905,68931671,59790949.839999996,68931671]
["Long term portion of trade payables",null,0,0,0,0,0]
["Other non-current liabilities",null,0,0,0,0,0]
["Total non current liabilities",null,{"$f":"SUM(C40:C43)","v":59790949.839999996},{"$f":"SUM(D40:D43)","v":58128905},{"$f":"SUM(E40:E43)","v":68931671},{"$f":"SUM(F40:F43)","v":59790949.839999996},{"$f":"SUM(G40:G43)","v":68931671}]
["TOTAL LIABILITIES",null,{"$f":"C38+C44","v":54121188.349999994},{"$f":"D38+D44","v":101432738},{"$f":"E38+E44","v":127134324},{"$f":"F38+F44","v":-18179992.340000011},{"$f":"G38+G44","v":127134324}]
["NET ASSETS",2,{"$f":"C27-C45","v":498757156.88},{"$f":"D27-D45","v":609496398},{"$f":"E27-E45","v":551851075},{"$f":"F27-F45","v":593584077.63},{"$f":"G27-G45","v":551851075}]
["COMMUNITY WEALTH/EQUITY"]
["Accumulated surplus/(deficit)",null,505151460.39999998,561761977,506392376,485193940.54000002,506392376]
["Reserves and funds",null,48578210.269999996,47734421,51578212,48578210.269999996,51578212]
["Other",null,0,0,0,0,0]
["TOTAL COMMUNITY WEALTH/EQUITY",2,{"$f":"SUM(C48:C50)","v":553729670.66999996},{"$f":"SUM(D48:D50)","v":609496398},{"$f":"SUM(E48:E50)","v":557970588},{"$f":"SUM(F48:F50)","v":533772150.81},{"$f":"SUM(G48:G50)","v":557970588}]
[{"$f":"head27a","v":"References"}]
["1. Material variances to be explained in Table SC1"]
["2. Net assets must balance with Total Community Wealth/Equity"]
[]
[]
["check balance",null,{"$f":"C46-C51","v":-54972513.789999962},{"$f":"D46-D51","v":0},{"$f":"E46-E51","v":-6119513},{"$f":"F46-F51","v":59811926.819999993},{"$f":"G46-G51","v":-6119513}]

{"sheet":"C7-CFlow","index":15,"n_rows":43,"n_cols":11,"rows_kept":43,"cut":false,"hidden":false,"merged":[[1,0,2,0],[1,1,2,1],[0,0,0,10]]}
[{"$f":"muni& \" - \"&S71F& \" - \"&date","v":"LIM353 Molemole - Table C7 Monthly Budget Statement - Cash Flow  - Q3 Third Quarter"}]
[{"$f":"desc","v":"Description"},{"$f":"head27","v":"Ref"},{"$f":"Head1","v":"2024/25"},{"$f":"Head2","v":"Budget Year 2025/26"}]
[null,null,{"$f":"Head5","v":"Audited Outcome"},{"$f":"Head6","v":"Original Budget"},{"$f":"Head7","v":"Adjusted Budget"},{"$f":"Head38","v":"Monthly actual"},{"$f":"Head39","v":"YearTD actual"},{"$f":"Head40","v":"YearTD budget"},{"$f":"Head41","v":"YTD variance"},{"$f":"Head41","v":"YTD variance"},{"$f":"Head8","v":"Full Year Forecast"}]
["R thousands",1,null,null,null,null,null,null,null,"%"]
["CASH FLOW FROM OPERATING ACTIVITIES"]
["Receipts"]
["Property rates",null,7889322.75,19664717,19664717,0,7209260.5599999996,14748537.779999999,{"$f":"G7-H7","v":-7539277.2199999997},{"$f":"IF(I7=0,\"\",I7/H7)","v":-0.51118811454134538},19664717]
["Service charges",null,1779257.63,14823588,14823588,0,956488.38,11117691,-10161202.619999999,{"$f":"IF(I8=0,\"\",I8/H8)","v":-0.91396699368600898},14823588]
["Other revenue",null,121166539.68000001,16909553,38045695,0,106439373.45999999,28534271.309999999,77905102.149999991,{"$f":"IF(I9=0,\"\",I9/H9)","v":2.7302292497197116},38045695]
["Transfers and Subsidies - Operational",null,193221124,207339000,191368000,0,143795945.66999999,143525999.88,269945.78999999166,{"$f":"IF(I10=0,\"\",I10/H10)","v":1.8808145578201121E-3},191368000]
["Transfers and Subsidies - Capital",null,38779000,52088000,52088000,0,36280000,39066000.030000001,-2786000.0300000012,{"$f":"IF(I11=0,\"\",I11/H11)","v":-7.131521087033596E-2},52088000]
["Interest",null,3691019.91,16695504,16695504,0,6665903.0899999999,12521628,-5855724.9100000001,-0.46764884805713763,16695504]
["Dividends",null,null,null,null,null,null,null,0,""]
["Payments"]
["Suppliers and employees",null,-329200428.05000001,-271341046,-280705367,0,-345700792.54000002,-211027890.13,{"$f":"H15-G15","v":134672902.41000003},-0.63817584645819647,-280705367]
["Interest",null,0,-2551064,-3085364,0,0,-2314023.0299999998,{"$f":"H16-G16","v":-2314023.0299999998},1,-3085364]
["Transfers and Subsidies",null,null,null,null,null,null,null,{"$f":"H17-G17","v":0},""]
["NET CASH FROM/(USED) OPERATING ACTIVITIES",null,{"$f":"SUM(C7:C13)+SUM(C15:C17)","v":37325835.920000017},53628252,48894773,0,-44353821.380000055,36172214.840000004,{"$f":"H18-G18","v":80526036.220000058},2.226184837621628,{"$f":"SUM(K7:K13)+SUM(K15:K17)","v":48894773}]
[]
["CASH FLOWS FROM INVESTING ACTIVITIES"]
["Receipts"]
["Proceeds on disposal of PPE",null,770042.12,0,0,0,0,0,{"$f":"G22-H22","v":0},{"$f":"IF(I22=0,\"\",I22/H22)","v":""},0]
[]
["Decrease (increase) in non-current receivables",null,0,0,0,0,0,0,{"$f":"G24-H24","v":0},"",0]
["Decrease (increase) in non-current investments",null,0,0,0,0,0,0,{"$f":"G25-H25","v":0},"",0]
["Payments"]
["Capital assets",null,-52822626.789999999,-64396800,-58277000,0,-20710825.82,-43707749.939999998,{"$f":"H27-G27","v":-22996924.119999997},0.5261520932001561,-58277000]
["NET CASH FROM/(USED) INVESTING ACTIVITIES",null,{"$f":"SUM(C22:C25)+C27","v":-52052584.670000002},{"$f":"SUM(D22:D25)+D27","v":-64396800},-58277000,0,-20710825.82,-43707749.939999998,{"$f":"H28-G28","v":-22996924.119999997},0.5261520932001561,{"$f":"SUM(K22:K25)+K27","v":-58277000}]
[]
["CASH FLOWS FROM FINANCING ACTIVITIES"]
["Receipts"]
["Short term loans",null,null,null,null,null,null,null,{"$f":"G32-H32","v":0},{"$f":"IF(I32=0,\"\",I32/H32)","v":""}]
["Borrowing long term/refinancing",null,null,null,null,null,null,null,{"$f":"G33-H33","v":0},""]
["Increase (decrease) in consumer deposits",null,null,null,null,null,null,null,{"$f":"G34-H34","v":0},""]
["Payments"]
["Repayment of borrowing",null,0,0,0,0,0,0,{"$f":"H36-G36","v":0},"",0]
["NET CASH FROM/(USED) FINANCING ACTIVITIES",null,{"$f":"SUM(C32:C34)+C36","v":0},0,0,0,0,0,{"$f":"H37-G37","v":0},"",{"$f":"SUM(K32:K34)+K36","v":0}]
[]
["NET INCREASE/ (DECREASE) IN CASH HELD",null,{"$f":"C18+C28+C37","v":-14726748.749999985},-10768548,-9382227,0,-65064647.200000055,-7535535.099999994,null,null,{"$f":"K18+K28+K37","v":-9382227}]
["Cash/cash equivalents at beginning:",null,140341085.08000001,140341086,140341086,67580471.199999928,132645118.40000001,{"$f":"IF(E40=0, D40, E40)","v":140341086},null,null,{"$f":"G40","v":132645118.40000001}]
["Cash/cash equivalents at month/year end:",null,{"$f":"C39+C40","v":125614336.33000003},129572538,130958859,67580471.199999928,67580471.199999958,132805550.90000001,null,null,{"$f":"K39+K40","v":123262891.40000001}]
["References"]
["1. Material variances to be explained in Table SC1"]

{"sheet":"SC1","index":16,"n_rows":47,"n_cols":5,"rows_kept":47,"cut":false,"hidden":false,"merged":[[1,0,2,0],[1,1,2,1],[0,0,0,4]]}
[{"$f":"muni& \" - \"&S71G& \" - \"&date","v":"LIM353 Molemole - Supporting Table SC1 Material variance explanations  - Q3 Third Quarter"}]
[{"$f":"head27","v":"Ref"},{"$f":"desc","v":"Description"}]
[null,null,"Variance","Reasons for material deviations","Remedial or corrective steps/remarks"]
[null,"R thousands"]
[1,"Revenue"]
[null,"Variances was Not Calculated"]
[]
[]
[]
[2,"Expenditure By Type"]
[null,"Variances was Not Calculated"]
[]
[]
[]
[3,{"$f":"RIGHT('C5-Capex'!A40,19)","v":"Capital Expenditure"}]
[null,"Variances was Not Calculated"]
[]
[]
[]
[4,"Financial Position"]
[null,"Variances was Not Calculated"]
[]
[]
[]
[5,"Cash Flow"]
[null,"Variances was Not Calculated"]
[]
[]
[]
[6,"Measureable performance"]
[]
[]
[]
[]
[7,"Municipal Entities"]
[]
[]
[]
[]
[]
[{"$f":"head27a","v":"References"}]
["1. Revenue for each source, vote and standard classification"]
["2. Expenditure for each type, vote and standard classification"]
["3. Capital expenditure for each vote and standard classification"]
["4. Explain any material variances between the annual budget and the expected financial position based on current trends"]
["5. Cash receipts by source and cash payments by type where not explained under revenue and expenditure"]
["6. For Sept, Dec, Mar and Jun statements explain any material variances in achievement of measurable performance objectives"]

{"sheet":"SC2","index":17,"n_rows":65,"n_cols":8,"rows_kept":65,"cut":false,"hidden":false,"merged":[[1,0,2,0],[1,1,2,1],[1,2,2,2],[0,0,0,7]]}
[{"$f":"muni& \" - \"&S71H& \" - \"&Head57","v":"LIM353 Molemole - Supporting Table SC2 Monthly Budget Statement - performance indicators   - Q3 Third Quarter"}]
["Description of financial indicator","Basis of calculation",{"$f":"head27","v":"Ref"},{"$f":"Head1","v":"2024/25"},{"$f":"Head2","v":"Budget Year 2025/26"}]
[null,null,null,{"$f":"Head5","v":"Audited Outcome"},{"$f":"Head6","v":"Original Budget"},{"$f":"Head7","v":"Adjusted Budget"},{"$f":"Head39","v":"YearTD actual"},{"$f":"Head8","v":"Full Year Forecast"}]
[]
["Borrowing Management"]
[]
["Capital Charges to Operating Expenditure","Interest & principal paid/Operating Expenditure",null,{"$f":"IF(ISERROR((D42-D43)/D45),0,((D42-D43)/D45))","v":9.501191342919062E-3},{"$f":"IF(ISERROR((E42+E44)/E45),0,((E42+E44)/E45))","v":8.4845369673106658E-2},{"$f":"IF(ISERROR((F42+F44)/F45),0,((F42+F44)/F45))","v":9.2736909060915904E-2},{"$f":"IF(ISERROR((G42+G44)/G45),0,((G42+G44)/G45))","v":4.8674351388737513E-5},{"$f":"IF(ISERROR((H42+H44)/H45),0,((H42+H44)/H45))","v":6.5931734003567513E-2}]
["Borrowed funding of 'own' capital expenditure","Borrowings/Capital expenditure excl. transfers and grants",null,{"$f":"IF(ISERROR(D47/D46),0,(D47/D46))","v":0},{"$f":"IF(ISERROR(E47/E46),0,(E47/E46))","v":0},{"$f":"IF(ISERROR(F47/F46),0,(F47/F46))","v":0},{"$f":"IF(ISERROR(G47/G46),0,(G47/G46))","v":0},{"$f":"IF(ISERROR(H47/H46),0,(H47/H46))","v":0}]
["Safety of Capital"]
["Debt to Equity","Loans, Accounts Payable, Overdraft & Tax Provision/ Funds & Reserves",null,{"$f":"IF(ISERROR(D48/D49),0,(D48/D49))","v":7.4929189670832425E-2},{"$f":"IF(ISERROR(E48/E49),0,(E48/E49))","v":7.1583747079010634E-2},{"$f":"IF(ISERROR(F48/F49),0,(F48/F49))","v":8.4403328800549612E-2},{"$f":"IF(ISERROR(G48/G49),0,(G48/G49))","v":-5.3656462437274545E-2},{"$f":"IF(ISERROR(H48/H49),0,(H48/H49))","v":8.4403328800549612E-2}]
["Gearing","Long Term Borrowing/ Funds & Reserves",null,{"$f":"IF(ISERROR(D51/D50),0,(D51/D50))","v":0},{"$f":"IF(ISERROR(E51/E50),0,(E51/E50))","v":0},{"$f":"IF(ISERROR(F51/F50),0,(F51/F50))","v":0},{"$f":"IF(ISERROR(G51/G50),0,(G51/G50))","v":0},{"$f":"IF(ISERROR(H51/H50),0,(H51/H50))","v":0}]
["Liquidity"]
["Current Ratio","Current assets/current liabilities",1,{"$f":"IF(ISERROR(D52/D53),0,(D52/D53))","v":-16.599279277619132},{"$f":"IF(ISERROR(E52/E53),0,(E52/E53))","v":5.1967059128460988},{"$f":"IF(ISERROR(F52/F53),0,(F52/F53))","v":2.7741980421407937},{"$f":"IF(ISERROR(G52/G53),0,(G52/G53))","v":-1.1832396482655914},{"$f":"IF(ISERROR(H52/H53),0,(H52/H53))","v":2.7741980421407937}]
["Liquidity Ratio","Monetary Assets/Current Liabilities",null,{"$f":"IF(ISERROR(D54/D53),0,(D54/D53))","v":-23.395184900449834},{"$f":"IF(ISERROR(E54/E53),0,(E54/E53))","v":2.9921724942916716},{"$f":"IF(ISERROR(F54/F53),0,(F54/F53))","v":2.3350822341380213},{"$f":"IF(ISERROR(G54/G53),0,(G54/G53))","v":-1.7547926295944625},{"$f":"IF(ISERROR(H54/H53),0,(H54/H53))","v":2.3350822341380213}]
["Revenue Management"]
["Annual Debtors Collection Rate \n(Payment Level %)","Last 12 Mths Receipts/ Last 12 Mths Billing"]
["Outstanding Debtors to Revenue","Total Outstanding Debtors to Annual Revenue",null,{"$f":"IF(ISERROR(D59/D55),0,(D59/D55))","v":3.0316889290144994E-2},{"$f":"IF(ISERROR(E59/E55),0,(E59/E55))","v":0.29871024280363401},{"$f":"IF(ISERROR(F59/F55),0,(F59/F55))","v":4.9300796588480571E-2},{"$f":"IF(ISERROR(G59/G55),0,(G59/G55))","v":2.8467051310303464E-2},{"$f":"IF(ISERROR(H59/H55),0,(H59/H55))","v":4.9300796588480571E-2}]
["Longstanding Debtors Recovered","Debtors > 12 Mths Recovered/Total Debtors > \n12 Months Old",null,{"$f":"IF(ISERROR(D64/D63),0,(D64/D63))","v":0},{"$f":"IF(ISERROR(E64/E63),0,(E64/E63))","v":0},{"$f":"IF(ISERROR(F64/F63),0,(F64/F63))","v":0},{"$f":"IF(ISERROR(G64/G63),0,(G64/G63))","v":0},{"$f":"IF(ISERROR(H64/H63),0,(H64/H63))","v":0}]
["Creditors Management"]
["Creditors System Efficiency","% of Creditors Paid Within Terms (within MFMA s 65(e))"]
["Funding of Provisions"]
["Percentage Of Provisions Not Funded","Unfunded Provisions/Total Provisions"]
["Other Indicators"]
["Electricity Distribution Losses","% Volume (units purchased and generated less units sold)/units purchased and generated",2,0,0,0,0,0]
["Water Distribution Losses","% Volume (units purchased and own source less units sold)/Total units purchased and own source",2]
["Employee costs","Employee costs/Total Revenue - capital revenue",null,{"$f":"IF(ISERROR(D40/D55),0,(D40/D55))","v":0.43034938375224069},{"$f":"IF(ISERROR(E40/E55),0,(E40/E55))","v":0.40771161962034824},{"$f":"IF(ISERROR(F40/F55),0,(F40/F55))","v":0.42203350525254407},{"$f":"IF(ISERROR(G40/G55),0,(G40/G55))","v":0.31823739952080771},{"$f":"IF(ISERROR(H40/H55),0,(H40/H55))","v":0.42203350525254407}]
["Repairs & Maintenance","R&M/Total Revenue - capital revenue",null,{"$f":"IF(ISERROR(D41/D55),0,(D41/D55))","v":5.2455135438069747E-2},{"$f":"IF(ISERROR(E41/E55),0,(E41/E55))","v":4.4423096995989453E-2},{"$f":"IF(ISERROR(F41/F55),0,(F41/F55))","v":4.6676655113954732E-2},{"$f":"IF(ISERROR(G41/G55),0,(G41/G55))","v":2.8219476326670288E-2},{"$f":"IF(ISERROR(H41/H55),0,(H41/H55))","v":4.6676655113954732E-2}]
["Interest & Depreciation","I&D/Total Revenue - capital revenue",null,{"$f":"IF(ISERROR((D42+D44)/D55),0,((D42+D44)/D55))","v":9.9272408629792433E-2},{"$f":"IF(ISERROR((E42+E44)/E55),0,((E42+E44)/E55))","v":8.140531179379655E-2},{"$f":"IF(ISERROR((F42+F44)/F55),0,((F42+F44)/F55))","v":9.107321418053646E-2},{"$f":"IF(ISERROR((G42+G44)/G55),0,((G42+G44)/G55))","v":3.3570584137922418E-5},{"$f":"IF(ISERROR((H42+H44)/H55),0,((H42+H44)/H55))","v":6.4748922440975729E-2}]
["IDP regulation financial viability indicators"]
["i. Debt coverage","(Total Operating Revenue - Operating Grants)/Debt service payments due within financial year)"]
["ii. O/S Service Debtors to Revenue","Total outstanding service debtors/annual revenue received for services"]
["iii. Cost coverage","(Available cash + Investments)/monthly fixed operational expenditure"]
["References"]
["1. Consumer debtors > 12 months old are excluded from current assets."]
["2. Material variances to be explained."]
[]
["Calculations"]
[{"$f":"'C6-FinPos'!A40","v":"Financial liabilities"},null,null,{"$f":"'C6-FinPos'!C40","v":0},{"$f":"'C6-FinPos'!D40","v":0},{"$f":"'C6-FinPos'!E40","v":0},{"$f":"'C6-FinPos'!F40","v":0},{"$f":"'C6-FinPos'!G40","v":0}]
["Total Assets",null,null,{"$f":"'C6-FinPos'!C27","v":552878345.23000002},{"$f":"'C6-FinPos'!D27","v":710929136},{"$f":"'C6-FinPos'!E27","v":678985399},{"$f":"'C6-FinPos'!F27","v":575404085.28999996},{"$f":"'C6-FinPos'!G27","v":678985399}]
["Employee related costs"," ",null,{"$f":"'C4-FinPerf RE'!C36","v":118552192.41},{"$f":"'C4-FinPerf RE'!D36","v":121240320},{"$f":"'C4-FinPerf RE'!E36","v":126130876},{"$f":"'C4-FinPerf RE'!G36","v":82373611.269999996},{"$f":"'C4-FinPerf RE'!K36","v":126130876}]
[{"$f":"A27","v":"Repairs & Maintenance"},null,null,{"$f":"+SC13c!C173","v":14450285.149999999},{"$f":"+SC13c!D173","v":13210000},{"$f":"+SC13c!E173","v":13950000},{"$f":"+SC13c!G173","v":7304421.7200000007},{"$f":"+SC13c!K173","v":13950000}]
["Interest (finance charges)",null,null,{"$f":"'C4-FinPerf RE'!C42","v":2935813.16},{"$f":"'C4-FinPerf RE'!D42","v":2551065},{"$f":"'C4-FinPerf RE'!E42","v":3085365},{"$f":"'C4-FinPerf RE'!G42","v":8689.52},{"$f":"'C4-FinPerf RE'!K42","v":3085365}]
["Principal paid",null,null,{"$f":"-'C7-CFlow'!C36","v":0},{"$f":"-'C7-CFlow'!D36","v":0},{"$f":"-'C7-CFlow'!E36","v":0},{"$f":"-'C7-CFlow'!G36","v":0},{"$f":"-'C7-CFlow'!K36","v":0}]
["Depreciation",null,null,{"$f":"'C4-FinPerf RE'!C41","v":24411644.82},{"$f":"'C4-FinPerf RE'!D41","v":21656256},{"$f":"'C4-FinPerf RE'!E41","v":24133195},{"$f":"'C4-FinPerf RE'!F41","v":0},{"$f":"'C4-FinPerf RE'!K37","v":16265796}]
["Operating expenditure",null,null,{"$f":"'C4-FinPerf RE'!C49","v":308994214.94},{"$f":"'C4-FinPerf RE'!D49","v":285311044},{"$f":"'C4-FinPerf RE'!E49","v":293502989},{"$f":"'C4-FinPerf RE'!G49","v":178523591.00999999},{"$f":"'C4-FinPerf RE'!K49","v":293502989}]
[{"$f":"'C5-Capex'!A40","v":"Total Capital Expenditure"},null,null,{"$f":"'C5-Capex'!C63","v":52822626.789999999},{"$f":"'C5-Capex'!D63","v":64396800},{"$f":"'C5-Capex'!E63","v":58277000},{"$f":"'C5-Capex'!F63","v":14105735.5},{"$f":"'C5-Capex'!G63","v":34816561.32}]
["Borrowed funding for capital",null,null,{"$f":"'C5-Capex'!C72","v":0},{"$f":"'C5-Capex'!D72","v":0},{"$f":"'C5-Capex'!E72","v":0},{"$f":"'C5-Capex'!G72","v":0},{"$f":"'C5-Capex'!K72","v":0}]
["Debt",null,null,{"$f":"'C6-FinPos'!C30+'C6-FinPos'!C31+'C6-FinPos'!C33+'C6-FinPos'!C34+'C6-FinPos'!C40+'C6-FinPos'!C43","v":41490515.520000003},{"$f":"'C6-FinPos'!D30+'C6-FinPos'!D31+'C6-FinPos'!D33+'C6-FinPos'!D34+'C6-FinPos'!D40+'C6-FinPos'!D43","v":43630036},{"$f":"'C6-FinPos'!E30+'C6-FinPos'!E31+'C6-FinPos'!E33+'C6-FinPos'!E34+'C6-FinPos'!E40+'C6-FinPos'!E43","v":47094575},{"$f":"'C6-FinPos'!F30+'C6-FinPos'!F31+'C6-FinPos'!F33+'C6-FinPos'!F34+'C6-FinPos'!F40+'C6-FinPos'!F43","v":-28640325.360000007},{"$f":"'C6-FinPos'!G30+'C6-FinPos'!G31+'C6-FinPos'!G33+'C6-FinPos'!G34+'C6-FinPos'!G40+'C6-FinPos'!G43","v":47094575}]
["Equity",null,null,{"$f":"'C6-FinPos'!C51","v":553729670.66999996},{"$f":"'C6-FinPos'!D51","v":609496398},{"$f":"'C6-FinPos'!E51","v":557970588},{"$f":"'C6-FinPos'!F51","v":533772150.81},{"$f":"'C6-FinPos'!G51","v":557970588}]
[{"$f":"'C6-FinPos'!A49","v":"Reserves and funds"},null,null,{"$f":"'C6-FinPos'!C50","v":0},{"$f":"'C6-FinPos'!D50","v":0},{"$f":"'C6-FinPos'!E50","v":0},{"$f":"'C6-FinPos'!F50","v":0},{"$f":"'C6-FinPos'!G50","v":0}]
["Borrowing",null,null,{"$f":"'C6-FinPos'!C40","v":0},{"$f":"'C6-FinPos'!D40","v":0},{"$f":"'C6-FinPos'!E40","v":0},{"$f":"'C6-FinPos'!F40","v":0},{"$f":"'C6-FinPos'!G40","v":0}]
[{"$f":"'C6-FinPos'!A6","v":"Current assets"},null,null,{"$f":"'C6-FinPos'!C14","v":94113954.410000011},{"$f":"'C6-FinPos'!D14","v":225037285},{"$f":"'C6-FinPos'!E14","v":161465686},{"$f":"'C6-FinPos'!F14","v":92258310.199999973},{"$f":"'C6-FinPos'!G14","v":161465686}]
[{"$f":"'C6-FinPos'!A29","v":"Current liabilities"},null,null,{"$f":"'C6-FinPos'!C38","v":-5669761.4900000021},{"$f":"'C6-FinPos'!D38","v":43303833},{"$f":"'C6-FinPos'!E38","v":58202653},{"$f":"'C6-FinPos'!F38","v":-77970942.180000007},{"$f":"'C6-FinPos'!G38","v":58202653}]
["Monetary assets",null,null,{"$f":"'C6-FinPos'!C7","v":132645118.40000001},{"$f":"'C6-FinPos'!D7","v":129572538},{"$f":"'C6-FinPos'!E7","v":135907981},{"$f":"'C6-FinPos'!F7","v":136822834.66},{"$f":"'C6-FinPos'!G7","v":135907981}]
["Total Revenue (excluding capital transfers and contributions)"," ",null,{"$f":"'C4-FinPerf RE'!C34","v":275478940.80000001},{"$f":"'C4-FinPerf RE'!D34","v":297367831},{"$f":"'C4-FinPerf RE'!E34","v":298864603},{"$f":"'C4-FinPerf RE'!G34","v":258843276.72999999},{"$f":"'C4-FinPerf RE'!K34","v":298864603}]
["Transfers and subsidies - Operational"," ",null,{"$f":"'C4-FinPerf RE'!C27","v":193141465.66},{"$f":"'C4-FinPerf RE'!D29","v":0},{"$f":"'C4-FinPerf RE'!E29","v":0},{"$f":"'C4-FinPerf RE'!G29","v":0},{"$f":"'C4-FinPerf RE'!K29","v":0}]
["Transfers and subsidies - capital (monetary allocations)"," ",null,{"$f":"'C4-FinPerf RE'!C51","v":37448726.670000002},{"$f":"'C4-FinPerf RE'!D51","v":52088000},{"$f":"'C4-FinPerf RE'!E51","v":52088000},{"$f":"'C4-FinPerf RE'!G51","v":23373512.649999999},{"$f":"'C4-FinPerf RE'!K51","v":52088000}]
["Debt service payments",null,null,{"$f":"'C7-CFlow'!C12+'C7-CFlow'!C36","v":3691019.91},{"$f":"'C7-CFlow'!D12+'C7-CFlow'!D36","v":16695504},{"$f":"'C7-CFlow'!E12+'C7-CFlow'!E36","v":16695504},{"$f":"'C7-CFlow'!F12+'C7-CFlow'!F36","v":0},{"$f":"'C7-CFlow'!G12+'C7-CFlow'!G36","v":6665903.0899999999}]
["Outstanding debtors (receivables)",null,null,{"$f":"'C6-FinPos'!C8+'C6-FinPos'!C9+'C6-FinPos'!C10+'C6-FinPos'!C13+'C6-FinPos'!C23+'C6-FinPos'!C24","v":8351664.5500000073},{"$f":"'C6-FinPos'!D8+'C6-FinPos'!D9+'C6-FinPos'!D10+'C6-FinPos'!D13+'C6-FinPos'!D23+'C6-FinPos'!D24","v":88826817},{"$f":"'C6-FinPos'!E8+'C6-FinPos'!E9+'C6-FinPos'!E10+'C6-FinPos'!E13+'C6-FinPos'!E23+'C6-FinPos'!E24","v":14734263},{"$f":"'C6-FinPos'!F8+'C6-FinPos'!F9+'C6-FinPos'!F10+'C6-FinPos'!F13+'C6-FinPos'!F23+'C6-FinPos'!F24","v":7368504.8399999887},{"$f":"'C6-FinPos'!G8+'C6-FinPos'!G9+'C6-FinPos'!G10+'C6-FinPos'!G13+'C6-FinPos'!G23+'C6-FinPos'!G24","v":14734263}]
["Annual services revenue",null,null,{"$f":"'C4-FinPerf RE'!C7+'C4-FinPerf RE'!C8+'C4-FinPerf RE'!C9+'C4-FinPerf RE'!C10+'C4-FinPerf RE'!C23","v":43165822.060000002},{"$f":"'C4-FinPerf RE'!D7+'C4-FinPerf RE'!D8+'C4-FinPerf RE'!D9+'C4-FinPerf RE'!D10+'C4-FinPerf RE'!D23","v":54454161},{"$f":"'C4-FinPerf RE'!E7+'C4-FinPerf RE'!E8+'C4-FinPerf RE'!E9+'C4-FinPerf RE'!E10+'C4-FinPerf RE'!E23","v":54454161},{"$f":"'C4-FinPerf RE'!F7+'C4-FinPerf RE'!F8+'C4-FinPerf RE'!F9+'C4-FinPerf RE'!F10+'C4-FinPerf RE'!F23","v":1774488.82},{"$f":"'C4-FinPerf RE'!G7+'C4-FinPerf RE'!G8+'C4-FinPerf RE'!G9+'C4-FinPerf RE'!G10+'C4-FinPerf RE'!G23","v":39781784.579999998}]
["Cash + investments","Including LT investments",null,{"$f":"'C6-FinPos'!C7+'C6-FinPos'!C16-'C6-FinPos'!C30","v":132645118.40000001},{"$f":"'C6-FinPos'!D7+'C6-FinPos'!D16-'C6-FinPos'!D30","v":129572538},{"$f":"'C6-FinPos'!E7+'C6-FinPos'!E16-'C6-FinPos'!E30","v":135907981},{"$f":"'C6-FinPos'!F7+'C6-FinPos'!F16-'C6-FinPos'!F30","v":136822834.66},{"$f":"'C6-FinPos'!G7+'C6-FinPos'!G16-'C6-FinPos'!G30","v":135907981}]
["Fixed operational expend. (monthly)"]
["Longstanding debtors outstanding",null,null,{"$f":"'C6-FinPos'!C23+'C6-FinPos'!C24","v":0},{"$f":"'C6-FinPos'!D23+'C6-FinPos'!D24","v":0},{"$f":"'C6-FinPos'!E23+'C6-FinPos'!E24","v":0},{"$f":"'C6-FinPos'!F23+'C6-FinPos'!F24","v":0},{"$f":"'C6-FinPos'!G23+'C6-FinPos'!G24","v":0}]
["Longstanding debtors recovered"]
["Attorney collections"]

{"sheet":"SC3","index":18,"n_rows":27,"n_cols":14,"rows_kept":27,"cut":false,"hidden":false,"merged":[[0,0,0,12],[1,2,1,13]]}
[{"$f":"muni& \" - \"&S71I& \" - \"&Head57","v":"LIM353 Molemole - Supporting Table SC3 Monthly Budget Statement - aged debtors - Q3 Third Quarter"}]
[{"$f":"desc","v":"Description"},null,{"$f":"Head2","v":"Budget Year 2025/26"}]
["R thousands","NT Code","0-30 Days","31-60 Days","61-90 Days","91-120 Days","121-150 Dys","151-180 Dys","181 Dys-1 Yr","Over 1Yr","Total","Total \nover 90 days","Actual Bad Debts Written Off against Debtors","Impairment - Bad Debts i.t.o Council Policy"]
["Debtors Age Analysis By Income Source"]
["Trade and Other Receivables from Exchange Transactions - Water",1200,0,0,0,5381168,0,0,0,0,{"$f":"SUM(C5:J5)","v":5381168},{"$f":"SUM(F5:J5)","v":5381168},0,0]
["Trade and Other Receivables from Exchange Transactions - Electricity",1300,0,0,0,1475612,0,0,0,0,{"$f":"SUM(C6:J6)","v":1475612},{"$f":"SUM(F6:J6)","v":1475612},0,0]
["Receivables from Non-exchange Transactions - Property Rates",1400,420726,316277,286911,13532957,0,0,0,0,{"$f":"SUM(C7:J7)","v":14556871},13532957,0,0]
["Receivables from Exchange Transactions - Waste Water Management",1500,0,0,0,3168775,0,0,0,0,3168775,3168775,0,0]
["Receivables from Exchange Transactions - Waste Management",1600,145699,101569,83571,17787861,0,0,0,0,18118700,{"$f":"SUM(F9:J9)","v":17787861},0,0]
["Receivables from Exchange Transactions - Property Rental Debtors",1700,null,null,null,null,null,null,null,null,0,{"$f":"SUM(F10:J10)","v":0}]
["Interest on Arrear Debtor Accounts",1810,null,null,null,null,null,null,null,null,0,0]
["Recoverable unauthorised, irregular, fruitless and wasteful expenditure",1820,null,null,null,null,null,null,null,null,0,0]
["Other",1900,5497805,8110026,314906,112984204,0,0,0,0,126906941,{"$f":"SUM(F13:J13)","v":112984204},0,0]
["Total By Income Source",2000,{"$f":"SUM(C5:C13)","v":6064230},8527872,685388,154330577,0,0,0,0,169608067,{"$f":"SUM(L5:L13)","v":154330577},0,0]
[{"$f":"Head1&\" - totals only\"","v":"2024/25 - totals only"},null,913448,3935239,876807,159302832,0,0,0,0,{"$f":"SUM(C15:J15)","v":165028326},{"$f":"SUM(F15:J15)","v":159302832},0,0]
["Debtors Age Analysis By Customer Group"]
["Organs of State",2200,11,35979,38512,41121210,0,0,0,0,{"$f":"SUM(C17:J17)","v":41195712},{"$f":"SUM(F17:J17)","v":41121210},0,0]
["Commercial",2300,144709,139117,135278,9325157,0,0,0,0,{"$f":"SUM(C18:J18)","v":9744261},{"$f":"SUM(F18:J18)","v":9325157},0,0]
["Households",2400,594118,509319,495029,42913019,0,0,0,0,{"$f":"SUM(C19:J19)","v":44511485},{"$f":"SUM(F19:J19)","v":42913019},0,0]
["Other",2500,5325392,7843457,16569,60971191,0,0,0,0,{"$f":"SUM(C20:J20)","v":74156609},{"$f":"SUM(F20:J20)","v":60971191},0,0]
["Total By Customer Group",2600,{"$f":"SUM(C17:C20)","v":6064230},8527872,685388,154330577,0,0,0,{"$f":"SUM(J17:J20)","v":0},{"$f":"SUM(K17:K20)","v":169608067},{"$f":"SUM(L17:L20)","v":154330577},{"$f":"SUM(M17:M20)","v":0},{"$f":"SUM(N17:N20)","v":0}]
["Notes"]
["Material increases in value of debtors' categories compared to previous month to be explained"]
["Bad debts = amounts actually written off in the month"]
["Total by Income Source must reconcile with Total by Customer Group"]
[null,null,{"$f":"C14-C21","v":0},{"$f":"D14-D21","v":0},{"$f":"E14-E21","v":0},0,0,0,0,{"$f":"J14-J21","v":0},0]
[null,null,{"$f":"IF(C26=0,\"\",\"MUST AGREE\")","v":""},{"$f":"IF(D26=0,\"\",\"MUST AGREE\")","v":""},"","","","","","",""]

{"sheet":"SC4","index":19,"n_rows":18,"n_cols":12,"rows_kept":18,"cut":false,"hidden":false,"merged":[[1,1,3,1],[2,2,3,2],[2,3,3,3],[1,11,3,11],[0,0,0,10],[2,8,3,8],[2,9,3,9],[2,10,3,10],[2,4,3,4],[2,5,3,5],[2,6,3,6],[2,7,3,7],[1,0,2,0]]}
[{"$f":"muni& \" - \"&S71J& \" - \"&Head57","v":"LIM353 Molemole - Supporting Table SC4 Monthly Budget Statement - aged creditors  - Q3 Third Quarter"}]
[{"$f":"desc","v":"Description"},"NT Code",{"$f":"Head2","v":"Budget Year 2025/26"},null,null,null,null,null,null,null,null,"Prior year totals for chart (same period)"]
[null,null,"0 - \n30 Days","31 - \n60 Days","61 - \n90 Days","91 - \n120 Days","121 - \n150 Days","151 - \n180 Days","181 Days -\n1 Year","Over 1\nYear","Total\n"]
["R thousands"]
["Creditors Age Analysis By Customer Type"]
["Bulk Electricity","0100",null,null,null,null,null,null,null,null,{"$f":"SUM(C6:J6)","v":0},0]
["Bulk Water","0200",null,null,null,null,null,null,null,null,{"$f":"SUM(C7:J7)","v":0},0]
["PAYE deductions","0300",null,null,null,null,null,null,null,null,0]
["VAT (output less input)","0400",null,null,null,null,null,null,null,null,0]
["Pensions / Retirement deductions","0500",null,null,null,null,null,null,null,null,0]
["Loan repayments","0600",null,null,null,null,null,null,null,null,0]
["Trade Creditors","0700",null,null,null,null,null,null,null,null,0]
["Auditor General","0800",null,null,null,null,null,null,null,null,0]
["Other","0900",25693,39987,0,0,0,7370,0,0,{"$f":"SUM(C14:J14)","v":73050}]
["Medical Aid deductions","0950",null,null,null,null,null,null,null,null,{"$f":"SUM(C15:J15)","v":0}]
["Total By Customer Type",1000,{"$f":"SUM(C6:C15)","v":25693},{"$f":"SUM(D6:D15)","v":39987},0,0,0,7370,0,0,73050,0]
["Notes"]
["Material increases in value of creditors' categories compared to previous month to be explained"]

{"sheet":"SC5","index":20,"n_rows":22,"n_cols":15,"rows_kept":22,"cut":false,"hidden":false,"merged":[[2,10,2,14],[0,0,0,9],[1,1,2,1],[1,3,2,3],[1,9,2,9]]}
[{"$f":"muni& \" - \"&S71K& \" - \"&Head57","v":"LIM353 Molemole - Supporting Table SC5 Monthly Budget Statement - investment portfolio  - Q3 Third Quarter"}]
["Investments by maturity\nName of institution & investment ID","Ref","Period of Investment","Type of Investment","Capital Guarantee\n(Yes/ No)","Variable or Fixed interest rate","Interest Rate ᶟ","Commission Paid (Rands)","Commission Recipient","Expiry date of investment","Opening balance","Interest to be realised","Partial / Premature Withdrawal (4)","Investment Top Up","Closing Balance"]
["R thousands",null,"Yrs/Months"]
["Municipality"]
[null,null,null,null,null,null,null,null,null,null,null,null,null,null,{"$f":"SUM(K5:N5)","v":0}]
["Municipality sub-total",null,null,null,null,null,null,null,null,null,{"$f":"SUM(K5:K5)","v":0},{"$f":"SUM(L5:L5)","v":0},{"$f":"SUM(M5:M5)","v":0},{"$f":"SUM(N5:N5)","v":0},{"$f":"SUM(O5:O5)","v":0}]
[]
["Entities"]
[null,null,null,null,null,null,null,null,null,null,null,null,null,null,{"$f":"SUM(K9:N9)","v":0}]
[null,null,null,null,null,null,null,null,null,null,null,null,null,null,0]
[null,null,null,null,null,null,null,null,null,null,null,null,null,null,0]
[null,null,null,null,null,null,null,null,null,null,null,null,null,null,0]
[null,null,null,null,null,null,null,null,null,null,null,null,null,null,0]
[null,null,null,null,null,null,null,null,null,null,null,null,null,null,0]
[null,null,null,null,null,null,null,null,null,null,null,null,null,null,0]
["Entities sub-total",null,null,null,null,null,null,null,null,null,{"$f":"SUM(K9:K15)","v":0},{"$f":"SUM(L9:L15)","v":0},{"$f":"SUM(M9:M15)","v":0},{"$f":"SUM(N9:N15)","v":0},{"$f":"SUM(O9:O15)","v":0}]
[]
["TOTAL INVESTMENTS AND INTEREST",2,null,null,null,null,null,null,null,null,{"$f":"K6+K16","v":0},{"$f":"L6+L16","v":0},{"$f":"M6+M16","v":0},{"$f":"N6+N16","v":0},{"$f":"O6+O16","v":0}]
[{"$f":"head27a","v":"References"}]
["2. List investments in expiry date order"]
["3. If 'variable' is selected in column F, input interest rate range"]
["4. Withdrawals to be entered as negative"]

{"sheet":"SC6","index":21,"n_rows":44,"n_cols":11,"rows_kept":44,"cut":false,"hidden":false,"merged":[[1,0,2,0],[1,1,2,1],[0,0,0,10]]}
[{"$f":"muni& \" - \"&S71L& \" - \"&Head57","v":"LIM353 Molemole - Supporting Table SC6 Monthly Budget Statement - transfers and grant receipts  - Q3 Third Quarter"}]
[{"$f":"desc","v":"Description"},{"$f":"head27","v":"Ref"},{"$f":"Head1","v":"2024/25"},{"$f":"Head2","v":"Budget Year 2025/26"}]
[null,null,{"$f":"Head5","v":"Audited Outcome"},{"$f":"Head6","v":"Original Budget"},{"$f":"Head7","v":"Adjusted Budget"},{"$f":"Head38","v":"Monthly actual"},{"$f":"Head39","v":"YearTD actual"},{"$f":"Head40","v":"YearTD budget"},{"$f":"Head41","v":"YTD variance"},{"$f":"Head41","v":"YTD variance"},{"$f":"Head8","v":"Full Year Forecast"}]
["R thousands",null,null,null,null,null,null,null,null,"%"]
["RECEIPTS:","1,2"]
[]
["Operating Transfers and Grants"]
["National Government:",null,{"$f":"SUM(C9:C15)","v":193141465.66},207339000,191368000,46731000,200773124.76999998,149115832,{"$f":"G8-H8","v":51657292.769999981},{"$f":"IF(H8=0,\"\",I8/H8)","v":0.34642393149776329},{"$f":"SUM(K9:K15)","v":191368000}]
["Equitable Share",null,187594124,186922000,186922000,46731000,186921945.66999999,140191497,46730448.669999987,0.33333297432439846,186922000]
["Expanded Public Works Programme Integrated Grant",null,1385014,1405000,1405000,0,971772,1053747,-81975,-7.779381578310543E-2,1405000]
["Integrated National Electrification Programme Grant",null,0,15971000,0,0,11171607,5589844,5581763,0.99855434248254515,0]
["Local Government Financial Management Grant",null,2138641.96,2200000,2200000,0,1575081.71,1649997,-74915.290000000037,-4.5403288612039926E-2,2200000]
["Municipal Demarcation Transition Grant",null,0,0,0,0,0,0,0,"",0]
["Municipal Disaster Relief Grant",3,0,0,0,0,0,0,0,"",0]
["Municipal Infrastructure Grant",null,2023685.7,841000,841000,0,132718.39000000001,630747,-498028.61,-0.78958538050914229,841000]
["Other transfers and grants [insert description]",null,null,null,null,null,null,null,{"$f":"G16-H16","v":0},{"$f":"IF(I16=0,\"\",I16/H16)","v":""}]
["Provincial Government:",null,{"$f":"SUM(C18:C19)","v":0},0,0,0,0,0,0,"",{"$f":"SUM(K18:K19)","v":0}]
[null,null,null,null,null,null,null,null,{"$f":"G18-H18","v":0},""]
["Other transfers and grants [insert description]",null,null,null,null,null,null,null,0,""]
["District Municipality:",null,{"$f":"SUM(C21:C21)","v":0},0,0,0,0,0,0,"",{"$f":"SUM(K21:K21)","v":0}]
["[insert description]",null,null,null,null,null,null,null,0,""]
["Other grant providers:",null,{"$f":"SUM(C23:C24)","v":0},0,0,0,0,0,{"$f":"G22-H22","v":0},{"$f":"IF(H22=0,\"\",I22/H22)","v":""},{"$f":"SUM(K23:K24)","v":0}]
["Education  Training and Development Practices SETA",null,0,0,0,0,0,0,{"$f":"G23-H23","v":0},{"$f":"IF(H23=0,\"\",I23/H23)","v":""},0]
["Non-statutory Forces",null,0,0,0,0,0,0,{"$f":"G24-H24","v":0},{"$f":"IF(H24=0,\"\",I24/H24)","v":""},0]
["Total Operating Transfers and Grants",5,{"$f":"C8+C17+C20+C22","v":193141465.66},207339000,191368000,46731000,200773124.76999998,149115832,51657292.769999981,0.34642393149776329,{"$f":"K8+K17+K20+K22","v":191368000}]
[]
["Capital Transfers and Grants"]
[{"$f":"A8","v":"National Government:"},null,{"$f":"SUM(C29:C29)","v":0},0,0,0,0,0,0,{"$f":"IF(I28=0,\"\",I28/H28)","v":""},{"$f":"SUM(K29:K29)","v":0}]
[null,null,null,null,null,null,null,null,{"$f":"G29-H29","v":0},""]
[{"$f":"A17","v":"Provincial Government:"},null,{"$f":"SUM(C31:C31)","v":0},0,0,0,0,0,{"$f":"G30-H30","v":0},{"$f":"IF(I30=0,\"\",I30/H30)","v":""},{"$f":"SUM(K31:K31)","v":0}]
["[insert description]",null,null,null,null,null,null,null,0,{"$f":"IF(I31=0,\"\",I31/H31)","v":""}]
[{"$f":"A20","v":"District Municipality:"},null,{"$f":"SUM(C33:C33)","v":0},0,0,0,0,0,0,"",{"$f":"SUM(K33:K33)","v":0}]
["[insert description]",null,null,null,null,null,null,null,0,""]
[{"$f":"A22","v":"Other grant providers:"},null,{"$f":"SUM(C35:C35)","v":0},0,0,0,0,0,0,"",{"$f":"SUM(K35:K35)","v":0}]
["[insert description]",null,null,null,null,null,null,null,{"$f":"G35-H35","v":0},""]
["Total Capital Transfers and Grants",5,{"$f":"C28+C30+C32+C34","v":0},0,0,0,0,0,0,"",{"$f":"K28+K30+K32+K34","v":0}]
[]
["TOTAL RECEIPTS OF TRANSFERS & GRANTS",5,{"$f":"C25+C36","v":193141465.66},207339000,191368000,46731000,200773124.76999998,149115832,51657292.769999981,0.34642393149776329,{"$f":"K25+K36","v":191368000}]
[{"$f":"head27a","v":"References"}]
["1. Each grant is listed by name as gazetted together with the name of the transferring department or municipality, donor or other organisation"]
["2. Grant expenditure must be separately listed for each grant received"]
["3. Replacement of RSC levies"]
["4. Housing subsidies for housing where ownership transferred"]
["5. Total recurrent/capital grants and subsidies must reconcile to the 'Financial Performance' Statement"]

{"sheet":"SC7","index":22,"n_rows":43,"n_cols":11,"rows_kept":43,"cut":false,"hidden":false,"merged":[[1,0,2,0],[1,1,2,1],[0,0,0,10]]}
[{"$f":"muni& \" - \"&S71M& \" - \"&Head57","v":"LIM353 Molemole - Supporting Table SC7(1) Monthly Budget Statement - transfers and grant expenditure  - Q3 Third Quarter"}]
[{"$f":"desc","v":"Description"},{"$f":"head27","v":"Ref"},{"$f":"Head1","v":"2024/25"},{"$f":"Head2","v":"Budget Year 2025/26"}]
[null,null,{"$f":"Head5","v":"Audited Outcome"},{"$f":"Head6","v":"Original Budget"},{"$f":"Head7","v":"Adjusted Budget"},{"$f":"Head38","v":"Monthly actual"},{"$f":"Head39","v":"YearTD actual"},{"$f":"Head40","v":"YearTD budget"},{"$f":"Head41","v":"YTD variance"},{"$f":"Head41","v":"YTD variance"},{"$f":"Head8","v":"Full Year Forecast"}]
["R thousands",null,null,null,null,null,null,null,null,"%"]
["EXPENDITURE"]
[]
["Operating expenditure of Transfers and Grants"]
[{"$f":"'SC6'!A8","v":"National Government:"},null,{"$f":"SUM(C9:C16)","v":172335099.66999999},174603428,179654075,-13258442.08,104461660.88000001,133110078.86,-28648417.979999993,{"$f":"IF(I8=0,\"\",I8/H8)","v":-0.21522350693016479},{"$f":"SUM(K9:K16)","v":179654075}]
[null,null,null,null,null,null,null,null,{"$f":"G9-H9","v":0},""]
["Equitable Share",null,147769127.94,152577628,156682203,523090.09,104946251.29000001,116212276.06,{"$f":"G10-H10","v":-11266024.769999996},{"$f":"IF(H10=0,\"\",I10/H10)","v":-9.6943499877615219E-2},156682203]
["Expanded Public Works Programme Integrated Grant",null,1385014,1405000,1405000,0,971772,1053756,-81984,-7.7801692232357389E-2,1405000]
["Integrated National Electrification Programme Grant",null,16893850.030000001,15971000,17217072,-13786500,-3714659.81,12476681.800000001,-16191341.610000001,-1.2977281836265153,17217072]
["Local Government Financial Management Grant",null,1944128.97,2200000,2200000,0,1436475.93,1650006,-213530.07000000007,-0.12941169304838895,2200000]
["Municipal Demarcation Transition Grant",null,2511181.91,1608800,1608800,0,690346.96,1206603,-516256.04000000004,-0.42785907212231367,1608800]
["Municipal Disaster Relief Grant",null,0,0,0,0,0,0,0,"",0]
["Municipal Infrastructure Grant",null,1831796.82,841000,541000,4967.83,131474.51,510756,-379281.49,-0.74258841795299513,541000]
[{"$f":"'SC6'!A17","v":"Provincial Government:"},null,{"$f":"SUM(C18:C18)","v":0},0,0,0,0,0,0,"",{"$f":"SUM(K18:K18)","v":0}]
[null,null,null,null,null,null,null,null,{"$f":"G18-H18","v":0},""]
[{"$f":"'SC6'!A20","v":"District Municipality:"},null,{"$f":"SUM(C20:C20)","v":0},0,0,0,0,0,0,"",{"$f":"SUM(K20:K20)","v":0}]
[null,null,null,null,null,null,null,null,0,""]
[{"$f":"'SC6'!A22","v":"Other grant providers:"},null,{"$f":"SUM(C22:C23)","v":0},0,0,0,0,0,0,"",{"$f":"SUM(K22:K23)","v":0}]
["Education  Training and Development Practices SETA",null,0,0,0,0,0,0,{"$f":"G22-H22","v":0},{"$f":"IF(H22=0,\"\",I22/H22)","v":""},0]
["Municipal Demarcation Board",null,0,0,0,0,0,0,{"$f":"G23-H23","v":0},{"$f":"IF(H23=0,\"\",I23/H23)","v":""},0]
["Total operating expenditure of Transfers and Grants:",null,{"$f":"C8+C17+C19+C21","v":172335099.66999999},174603428,179654075,-13258442.08,104461660.88000001,133110078.86,-28648417.979999993,-0.21522350693016479,{"$f":"K8+K17+K19+K21","v":179654075}]
[]
["Capital expenditure of Transfers and Grants"]
[{"$f":"'SC6'!A28","v":"National Government:"},null,{"$f":"SUM(C28:C32)","v":32564110.16},52088000,52388000,14128351.5,34158751.32,39186012,-5027260.68,{"$f":"IF(I27=0,\"\",I27/H27)","v":-0.12829222529712897},{"$f":"SUM(K28:K32)","v":52388000}]
["Energy Efficiency and Demand Side Management Grant",null,0,0,0,0,0,0,{"$f":"G28-H28","v":0},{"$f":"IF(H28=0,\"\",I28/H28)","v":""},0]
["Integrated National Electrification Programme Grant",null,0,0,0,13786500,13786500,0,{"$f":"G29-H29","v":13786500},{"$f":"IF(H29=0,\"\",I29/H29)","v":""},0]
["Municipal Disaster Recovery Grant  ",null,0,0,0,0,0,0,{"$f":"G30-H30","v":0},{"$f":"IF(H30=0,\"\",I30/H30)","v":""},0]
["Municipal Disaster Relief Grant",null,0,0,0,0,0,0,{"$f":"G31-H31","v":0},{"$f":"IF(H31=0,\"\",I31/H31)","v":""},0]
["Municipal Infrastructure Grant ",null,32564110.16,52088000,52388000,341851.5,20372251.32,39186012,{"$f":"G32-H32","v":-18813760.68},{"$f":"IF(H32=0,\"\",I32/H32)","v":-0.48011419687208789},52388000]
[{"$f":"'SC6'!A30","v":"Provincial Government:"},null,{"$f":"SUM(C34:C34)","v":0},0,0,0,0,0,{"$f":"G33-H33","v":0},"",{"$f":"SUM(K34:K34)","v":0}]
["Infrastructure Grant",null,0,0,0,0,0,0,{"$f":"G34-H34","v":0},{"$f":"IF(H34=0,\"\",I34/H34)","v":""},0]
[{"$f":"'SC6'!A32","v":"District Municipality:"},null,{"$f":"SUM(C36:C36)","v":0},0,0,0,0,0,0,"",{"$f":"SUM(K36:K36)","v":0}]
["Specify (Add grant description)",null,0,0,0,0,0,0,{"$f":"G36-H36","v":0},{"$f":"IF(H36=0,\"\",I36/H36)","v":""},0]
[{"$f":"'SC6'!A34","v":"Other grant providers:"},null,{"$f":"SUM(C38:C39)","v":0},0,0,0,0,0,0,"",{"$f":"SUM(K38:K39)","v":0}]
["Municipal Demarcation Board",null,0,0,0,0,0,0,{"$f":"G38-H38","v":0},{"$f":"IF(H38=0,\"\",I38/H38)","v":""},0]
["Municipal Infrastructure Investment Unit",null,0,0,0,0,0,0,{"$f":"G39-H39","v":0},{"$f":"IF(H39=0,\"\",I39/H39)","v":""},0]
["Total capital expenditure of Transfers and Grants",null,{"$f":"C27+C33+C35+C37","v":32564110.16},52088000,52388000,14128351.5,34158751.32,39186012,-5027260.68,{"$f":"IF(I40=0,\"\",I40/H40)","v":-0.12829222529712897},{"$f":"K27+K33+K35+K37","v":52388000}]
[]
["TOTAL EXPENDITURE OF TRANSFERS AND GRANTS",null,{"$f":"C24+C40","v":204899209.82999998},226691428,232042075,869909.41999999993,138620412.20000002,172296090.86000001,-33675678.659999996,{"$f":"IF(I42=0,\"\",I42/H42)","v":-0.1954523662835933},{"$f":"K24+K40","v":232042075}]
[{"$f":"head27a","v":"References"}]

{"sheet":"SC8","index":23,"n_rows":134,"n_cols":11,"rows_kept":134,"cut":false,"hidden":false,"merged":[[0,0,0,10],[1,0,2,0],[1,1,2,1]]}
[{"$f":"muni& \" - \"&S71N& \" - \"&Head57","v":"LIM353 Molemole - Supporting Table SC8 Monthly Budget Statement - councillor and staff benefits  - Q3 Third Quarter"}]
["Summary of Employee and Councillor remuneration",{"$f":"head27","v":"Ref"},{"$f":"Head1","v":"2024/25"},{"$f":"Head2","v":"Budget Year 2025/26"}]
[null,null,{"$f":"Head5","v":"Audited Outcome"},{"$f":"Head6","v":"Original Budget"},{"$f":"Head7","v":"Adjusted Budget"},{"$f":"Head38","v":"Monthly actual"},{"$f":"Head39","v":"YearTD actual"},{"$f":"Head40","v":"YearTD budget"},{"$f":"Head41","v":"YTD variance"},{"$f":"Head41","v":"YTD variance"},{"$f":"Head8","v":"Full Year Forecast"}]
["R thousands",null,null,null,null,null,null,null,null,"%"]
[null,1,"A","B","C",null,null,null,null,null,"D"]
["Councillors (Political Office Bearers plus Other)"]
["Basic Salaries and Wages",null,9513994.5800000001,10828930,10680825,0,6355449.9199999999,8062484,{"$f":"G7-H7","v":-1707034.08},{"$f":"IF(I7=0,\"\",I7/H7)","v":-0.21172557737789},10680825]
["Pension and UIF Contributions",null,0,0,0,0,0,0,0,"",0]
["Medical Aid Contributions",null,0,0,0,0,0,0,0,"",0]
["Motor Vehicle Allowance",null,null,null,null,null,null,null,0,""]
["Cellphone Allowance",null,1500211,1712623,1712623,0,1002752,1284489,-281737,-0.21933780670757008,1712623]
["Housing Allowances",null,null,null,null,null,null,null,0,""]
["Other benefits and allowances",null,3171379.56,3872348,3872348,0,2118483.92,2904300,-785816.08000000007,-0.27056987225837553,3872348]
["Sub Total - Councillors",null,{"$f":"SUM(C7:C13)","v":14185585.140000001},16413901,16265796,0,9476685.8399999999,12251273,-2774587.16,-0.22647337627689793,{"$f":"SUM(K7:K13)","v":16265796}]
["% increase",4,null,{"$f":"IF(D14=0,\"\",(D14/C14)-1)","v":0.15708311204707903},{"$f":"IF(E14=0,\"\",(E14/C14)-1)","v":0.1466425839660499},null,null,null,null,null,{"$f":"IF(K14=0,\"\",(K14/C14)-1)","v":0.1466425839660499}]
[]
["Senior Managers of the Municipality",3]
["Basic Salaries and Wages",null,2436093.12,5061192,4235710,0,1034497.89,3465746.2,{"$f":"G18-H18","v":-2431248.31},{"$f":"IF(I18=0,\"\",I18/H18)","v":-0.70150789172040351},4235710]
["Pension and UIF Contributions",null,0,0,0,0,0,0,0,"",0]
["Medical Aid Contributions",null,0,0,0,0,0,0,0,"",0]
["Overtime",null,0,0,0,0,0,0,0,"",0]
["Performance Bonus",null,203007.76,559922,486839,0,205491.44,390751.8,-185260.36,-0.47411262085037098,486839]
["Motor Vehicle Allowance",null,879700.32,1876462,1586039,0,504614.88,1291187.8,-786572.92,-0.60918552669100501,1586039]
["Cellphone Allowance",null,203400,323611,279490,0,-78400,225081.60000000001,-303481.59999999998,-1.3483181210725352,279490]
["Housing Allowances",null,0,0,0,0,0,0,0,"",0]
["Other benefits and allowances",null,407411.65,915761,772326,0,306888.34000000003,629452,-322563.65999999997,-0.51245156104039702,772326]
["Payments in lieu of leave",null,0,157725,84637,0,149454.63,89060.800000000003,60393.83,0.67811910515063867,84637]
["Long service awards",null,0,0,0,0,0,0,0,"",0]
["Post-retirement benefit obligations",2,42410.37,42060,42060,0,0,31545,-31545,-1,42060]
["Entertainment",null,0,0,0,0,0,0,{"$f":"G30-H30","v":0},{"$f":"IF(I30=0,\"\",I30/H30)","v":""},0]
["Scarcity",null,null,null,null,null,null,null,0,""]
["Acting and post related allowance",null,0,55153,55153,0,7677.71,41382,-33704.29,-0.81446740128558315,55153]
["In kind benefits",null,null,null,null,null,null,null,0,""]
["Sub Total - Senior Managers of Municipality",null,{"$f":"SUM(C18:C33)","v":4172023.2199999997},8991886,7542254,0,2130224.89,6164207.1999999993,{"$f":"G34-H34","v":-4033982.3099999991},{"$f":"IF(I34=0,\"\",I34/H34)","v":-0.65442029755261955},{"$f":"SUM(K18:K33)","v":7542254}]
["% increase",4,null,{"$f":"IF(D34=0,\"\",(D34/C34)-1)","v":1.1552818682538399},{"$f":"IF(E34=0,\"\",(E34/C34)-1)","v":0.80781687979195871},null,null,null,null,null,{"$f":"IF(K34=0,\"\",(K34/C34)-1)","v":0.80781687979195871}]
[]
["Other Municipal Staff"]
["Basic Salaries and Wages",null,70811741.219999999,65564334,70782070,0,52154748.82,51155475.579999998,{"$f":"G38-H38","v":999273.24000000209},{"$f":"IF(I38=0,\"\",I38/H38)","v":1.9534042615580394E-2},70782070]
["Pension and UIF Contributions",null,14319926.6,13223109,14428705,0,10473891.869999999,10494988.34,-21096.470000000671,-2.0101470641558303E-3,14428705]
["Medical Aid Contributions",null,6303723.3799999999,6201719,6696131,0,4637201.8600000003,4901671.8,-264469.93999999948,-5.3955048561186714E-2,6696131]
["Overtime",null,628343.79,730151,730151,0,283498.64,547641,-264142.36,-0.48232758321601193,730151]
["Performance Bonus",null,5984324.7199999997,6879172,7463669,0,4332654.66,5390958.8300000001,-1058304.17,-0.19631093528495744,7463669]
["Motor Vehicle Allowance",null,7749932.54,9774708,8571963,0,5720956.0499999998,6757273.0300000003,-1036316.9800000004,-0.15336319479753216,8571963]
["Cellphone Allowance",null,1862717.1,2543855,2027492,0,1235840,1701445.8,-465605.80000000005,-0.27365303085176151,2027492]
["Housing Allowances",null,250445.52,309023,314024,0,180215.42,233822.4,-53606.979999999981,-0.22926366336159401,314024]
["Other benefits and allowances",null,988751.3,1195580,1312586,0,658778.71,961206.34,-302427.63,-0.31463341159401842,1312586]
["Payments in lieu of leave",null,629125.14,358612,371612,0,-25478,274174,-299652,-1.0929263898108501,371612]
["Long service awards",null,1851000,2428318,2444318,0,69099.09,1827811,-1758711.91,-0.96219571388945568,2444318]
["Post-retirement benefit obligations",2,2561589.63,2627233,2627233,0,0,1970622,-1970622,-1,2627233]
["Entertainment",null,null,null,null,null,null,null,0,""]
["Scarcity",null,null,null,null,null,null,null,0,""]
["Acting and post related allowance",null,438548.25,412620,818668,0,521979.26,506911.08,15068.179999999993,2.9725489527670203E-2,818668]
["In kind benefits",null,null,null,null,null,null,null,0,""]
["Sub Total - Other Municipal Staff",null,{"$f":"SUM(C38:C53)","v":114380169.18999998},112248434,118588622,0,80243386.379999995,86724001.200000003,-6480614.8200000077,-7.4726889100223015E-2,{"$f":"SUM(K38:K53)","v":118588622}]
["% increase",4,null,{"$f":"IF(D54=0,\"\",(D54/C54)-1)","v":-1.8637279565996256E-2},{"$f":"IF(E54=0,\"\",(E54/C54)-1)","v":3.679355293669162E-2},null,null,null,null,null,{"$f":"IF(K54=0,\"\",(K54/C54)-1)","v":3.679355293669162E-2}]
["Total Parent Municipality",null,{"$f":"C14+C34+C54","v":132737777.54999998},137654221,142396672,0,91850297.109999999,105139481.40000001,{"$f":"G56-H56","v":-13289184.290000007},{"$f":"IF(I56=0,\"\",I56/H56)","v":-0.12639575650408341},{"$f":"K14+K34+K54","v":142396672}]
[null,null,null,{"$f":"IF(D56=0,\"\",(D56/C56)-1)","v":3.7038765758663494E-2},{"$f":"IF(E56=0,\"\",(E56/C56)-1)","v":7.2766733241120374E-2},null,null,null,null,null,{"$f":"IF(K56=0,\"\",(K56/C56)-1)","v":7.2766733241120374E-2}]
["Unpaid salary, allowances & benefits in arrears:"]
[]
["Board Members of Entities"]
["Basic Salaries and Wages",null,null,null,null,null,null,null,{"$f":"G61-H61","v":0},{"$f":"IF(I61=0,\"\",I61/H61)","v":""}]
["Pension and UIF Contributions",null,null,null,null,null,null,null,0,""]
["Medical Aid Contributions",null,null,null,null,null,null,null,0,""]
["Overtime",null,null,null,null,null,null,null,0,""]
["Performance Bonus",null,null,null,null,null,null,null,0,""]
["Motor Vehicle Allowance",null,null,null,null,null,null,null,0,""]
["Cellphone Allowance",null,null,null,null,null,null,null,0,""]
["Housing Allowances",null,null,null,null,null,null,null,0,""]
["Other benefits and allowances",null,null,null,null,null,null,null,0,""]
["Board Fees",5,null,null,null,null,null,null,0,""]
["Payments in lieu of leave",null,null,null,null,null,null,null,0,""]
["Long service awards",null,null,null,null,null,null,null,0,""]
["Post-retirement benefit obligations",null,null,null,null,null,null,null,0,""]
["Entertainment",null,null,null,null,null,null,null,{"$f":"G74-H74","v":0},{"$f":"IF(I74=0,\"\",I74/H74)","v":""}]
["Scarcity",null,null,null,null,null,null,null,0,""]
["Acting and post related allowance",null,null,null,null,null,null,null,0,""]
["In kind benefits",null,null,null,null,null,null,null,0,""]
["Sub Total - Executive members Board",2,{"$f":"SUM(C61:C77)","v":0},0,0,0,0,0,{"$f":"G78-H78","v":0},{"$f":"IF(I78=0,\"\",I78/H78)","v":""},{"$f":"SUM(K61:K77)","v":0}]
["% increase",4,null,{"$f":"IF(D78=0,\"\",(D78/C78)-1)","v":""},{"$f":"IF(E78=0,\"\",(E78/C78)-1)","v":""},null,null,null,null,null,{"$f":"IF(K78=0,\"\",(K78/C78)-1)","v":""}]
[]
["Senior Managers of Entities"]
["Basic Salaries and Wages",null,null,null,null,null,null,null,{"$f":"G82-H82","v":0},{"$f":"IF(I82=0,\"\",I82/H82)","v":""}]
["Pension and UIF Contributions",null,null,null,null,null,null,null,0,""]
["Medical Aid Contributions",null,null,null,null,null,null,null,0,""]
["Overtime",null,null,null,null,null,null,null,0,""]
["Performance Bonus",null,null,null,null,null,null,null,0,""]
["Motor Vehicle Allowance",null,null,null,null,null,null,null,0,""]
["Cellphone Allowance",null,null,null,null,null,null,null,0,""]
["Housing Allowances",null,null,null,null,null,null,null,0,""]
["Other benefits and allowances",null,null,null,null,null,null,null,0,""]
["Payments in lieu of leave",null,null,null,null,null,null,null,0,""]
["Long service awards",null,null,null,null,null,null,null,0,""]
["Post-retirement benefit obligations",2,null,null,null,null,null,null,0,""]
["Entertainment",null,null,null,null,null,null,null,{"$f":"G94-H94","v":0},{"$f":"IF(I94=0,\"\",I94/H94)","v":""}]
["Scarcity",null,null,null,null,null,null,null,0,""]
["Acting and post related allowance",null,null,null,null,null,null,null,0,""]
["In kind benefits",null,null,null,null,null,null,null,0,""]
["Sub Total - Senior Managers of Entities",null,{"$f":"SUM(C82:C97)","v":0},0,0,0,0,0,{"$f":"G98-H98","v":0},{"$f":"IF(I98=0,\"\",I98/H98)","v":""},{"$f":"SUM(K82:K97)","v":0}]
["% increase",4,null,{"$f":"IF(D98=0,\"\",(D98/C98)-1)","v":""},{"$f":"IF(E98=0,\"\",(E98/C98)-1)","v":""},null,null,null,null,null,{"$f":"IF(K98=0,\"\",(K98/C98)-1)","v":""}]
[]
["Other Staff of Entities"]
["Basic Salaries and Wages",null,null,null,null,null,null,null,{"$f":"G102-H102","v":0},{"$f":"IF(I102=0,\"\",I102/H102)","v":""}]
["Pension and UIF Contributions",null,null,null,null,null,null,null,0,""]
["Medical Aid Contributions",null,null,null,null,null,null,null,0,""]
["Overtime",null,null,null,null,null,null,null,0,""]
["Performance Bonus",null,null,null,null,null,null,null,0,""]
["Motor Vehicle Allowance",null,null,null,null,null,null,null,0,""]
["Cellphone Allowance",null,null,null,null,null,null,null,0,""]
["Housing Allowances",null,null,null,null,null,null,null,0,""]
["Other benefits and allowances",null,null,null,null,null,null,null,0,""]
["Payments in lieu of leave",null,null,null,null,null,null,null,0,""]
["Long service awards",null,null,null,null,null,null,null,0,""]
["Post-retirement benefit obligations",null,null,null,null,null,null,null,0,""]
["Entertainment",null,null,null,null,null,null,null,0,""]
["Scarcity",null,null,null,null,null,null,null,0,""]
["Acting and post related allowance",null,null,null,null,null,null,null,0,""]
["In kind benefits",null,null,null,null,null,null,null,0,""]
["Sub Total - Other Staff of Entities",null,{"$f":"SUM(C102:C117)","v":0},0,0,0,0,0,{"$f":"G118-H118","v":0},{"$f":"IF(I118=0,\"\",I118/H118)","v":""},{"$f":"SUM(K102:K117)","v":0}]
["% increase",4,null,{"$f":"IF(D118=0,\"\",(D118/C118)-1)","v":""},{"$f":"IF(E118=0,\"\",(E118/C118)-1)","v":""},null,null,null,null,null,{"$f":"IF(K118=0,\"\",(K118/C118)-1)","v":""}]
["Total Municipal Entities",null,{"$f":"C78+C98+C118","v":0},0,0,0,0,0,{"$f":"G120-H120","v":0},{"$f":"IF(I120=0,\"\",I120/H120)","v":""},{"$f":"K78+K98+K118","v":0}]
["TOTAL SALARY, ALLOWANCES & BENEFITS",null,{"$f":"C56+C120","v":132737777.54999998},137654221,142396672,0,91850297.109999999,105139481.40000001,{"$f":"G121-H121","v":-13289184.290000007},{"$f":"IF(I121=0,\"\",I121/H121)","v":-0.12639575650408341},{"$f":"K56+K120","v":142396672}]
["% increase",4,null,{"$f":"IF(D121=0,\"\",(D121/C121)-1)","v":3.7038765758663494E-2},{"$f":"IF(E121=0,\"\",(E121/C121)-1)","v":7.2766733241120374E-2},null,null,null,null,null,{"$f":"IF(K121=0,\"\",(K121/C121)-1)","v":7.2766733241120374E-2}]
["TOTAL MANAGERS AND STAFF",null,{"$f":"C34+C54+C98+C118","v":118552192.40999998},121240320,126130876,0,82373611.269999996,92888208.400000006,-10514597.130000006,{"$f":"IF(I123=0,\"\",I123/H123)","v":-0.1131962529056595},{"$f":"K34+K54+K98+K118","v":126130876}]
[{"$f":"head27a","v":"References"}]
["1. Include 'Loans and advances' where applicable if any reportable amounts until phased compliance with s164 of MFMA achieved"]
["2. If benefits in kind are provided (e.g. provision of living quarters) the full market value must be shown as the cost to the municipality"]
["3. s57 of the Systems Act"]
["4. B/A, C/A, D/A"]
["5. Included in Contracted services"]
["Column Definitions:"]
["A. Audited actual 2022/23 (audited financial statements). If audited amounts unavailable, unaudited amounts must be provided with a note stating these are unaudited"]
["B. The original budget approved by council for the 2023/24 budget year."]
["C. The budget for 2023/24 budget year as adjusted by council resolution in terms of section 28 of the MFMA."]
["D. An estimate of final actual amounts (pre audit - 2006/07 budget year) at the time of preparing the budget for the 2007/08 budget year. This may differ from C."]

{"sheet":"SC9","index":24,"n_rows":62,"n_cols":17,"rows_kept":62,"cut":false,"hidden":false,"merged":[[2,15,3,15],[2,16,3,16],[1,0,2,0],[2,14,3,14],[1,1,2,1],[1,2,1,13],[1,14,1,16]]}
[{"$f":"muni& \" - \"&S71O& \" - \"&Head57","v":"LIM353 Molemole - Supporting Table SC9 Monthly Budget Statement - actuals and revised targets for cash receipts - Q3 Third Quarter"}]
[{"$f":"desc","v":"Description"},{"$f":"head27","v":"Ref"},{"$f":"Head2","v":"Budget Year 2025/26"},null,null,null,null,null,null,null,null,null,null,null,{"$f":"'Template names'!B5","v":"2025/26 Medium Term Revenue & Expenditure Framework"}]
[null,null,"July","August","Sept","October","Nov","Dec","January","Feb","March","April","May","June",{"$f":"Head9","v":"Budget Year 2025/26"},{"$f":"Head10","v":"Budget Year +1 2026/27"},{"$f":"Head11","v":"Budget Year +2 2027/28"}]
["R thousands",1,"Outcome","Outcome","Outcome","Outcome","Outcome","Outcome","Outcome","Outcome","Outcome","Budget","Budget","Budget"]
["Cash Receipts By Source"]
["Property rates",null,184323.96,306696.65000000002,356582.68,280983.03000000003,4086239.98,262593.36,625110.29,1106730.6100000001,0,1638726.42,1638726.42,{"$f":"O6-SUM(C6:M6)","v":9178003.5999999996},19664717,33299051,35047251]
["Service charges - Electricity revenue",null,786.47,2182.5100000000002,5505.57,1112.18,1278.6300000000001,1278.6300000000001,1167.5999999999999,1994.02,0,1183452.83,1183452.83,11819222.73,14201434,33183455,32646924]
["Service charges - Water revenue",null,17291.66,26041.65,21318.959999999999,13034.27,11915.95,11693.91,5028.92,26504.39,0,0,0,-132829.71,0,0,0]
["Service charges - Waste Water Management",null,33213.22,34233.78,42665.440000000002,31501.85,17142.830000000002,17991.150000000001,23734.55,38324.769999999997,0,0,0,-238807.58999999997,0,0,0]
["Service charges - Waste Mangement",null,50629.59,86587.35,105144.2,60583.01,47605.59,48400.46,54973.82,115621.45,0,51846.17,51846.17,-51083.810000000056,622154,-4381057,-2282792]
[null,null,null,null,null,null,null,null,null,null,null,null,null,0]
["Rental of facilities and equipment",null,18998.04,19519.78,18998.04,18998.04,18998.04,18998.04,8959.09,35297.86,0,0,0,-158766.93,0,0,0]
["Interest earned - external investments",null,418283.09,1001105.37,1074652.51,996941.51,982042.35,814495.6,562026.63,453827.96,0,1391292,1391292,7609544.9800000004,16695504,19313238,20327183]
["Interest earned - outstanding debtors",null,33272.5,54141.25,55919.26,36814.129999999997,23671.3,33424.35,45964.12,79321.16,0,0,0,-362528.07000000007,0,0,0]
["Dividends received",null,null,null,null,null,null,null,null,null,null,null,null,0]
["Fines, penalties and forfeits",null,136.52000000000001,176.52,278.26,175.65,0,7443.48,0,0,0,12244.83,12244.83,114237.91,146938,931780,963048]
["Licences and permits",null,800,1098621.8,907470.73,1136021.22,1158232.01,909394.68,1103971.1299999999,1110084.03,0,1204164.67,1204164.67,4617051.0600000005,14449976,12892535,13569392]
["Agency services",null,33383.61,31807.62,31406.17,30490.12,30525.43,30573.05,30491.95,-18.350000000000001,0,42730,42730,208640.40000000002,512760,531733,559648]
["Transfers and Subsidies - Operational",null,77884000,2550000,0,0,0,62938945.670000002,0,423000,0,15947333.32,15947333.32,15677387.689999998,191368000,189384850,186262620]
["Other revenue",null,72292299.049999997,8932550.0099999998,3319280.1,2490969.92,1427958.54,3215094.82,4909483.24,2041505.22,0,1911335.09,1911335.09,-79515790.079999998,22936021,21046410,30259740]
["Cash Receipts by Source",null,{"$f":"SUM(C6:C20)","v":150967417.70999998},14143664.289999999,5939221.9199999999,5097624.93,7805610.6499999994,68310327.200000003,7370911.3399999999,5432193.1200000001,0,23383125.330000002,23383125.330000002,-31235717.82,280597504,306201995,317353014]
["Other Cash Flows by Source",null,null,null,null,null,null,null,null,null,null,null,null,{"$f":"O22-SUM(C22:M22)","v":0}]
["Transfers and subsidies - capital (monetary allocations) (National / Provincial and District)",null,7825000,0,14430000,0,0,14025000,0,0,0,4340666.67,4340666.67,7126666.6599999964,52088000,50119150,45592400]
["Transfers and subsidies - capital (monetary allocations) (Nat / Prov Departm Agencies, Households, Non-profit Institutions, Private Enterprises, Public Corporatons, Higher Educ Institutions)",null,null,null,null,null,null,null,null,null,null,null,null,0]
["Proceeds on Disposal of Fixed and Intangible Assets",null,0,0,0,0,0,0,0,0,0,0,0,0,0,32960000,0]
["Short term loans",null,null,null,null,null,null,null,null,null,null,null,null,0]
["Borrowing long term/refinancing",null,null,null,null,null,null,null,null,null,null,null,null,0]
["Increase (decrease) in consumer deposits",null,null,null,null,null,null,null,null,null,null,null,null,0]
["VAT Control (receipts)",null,null,null,null,null,null,null,null,null,null,null,null,0]
["Decrease (increase) in non-current receivables",null,0,0,0,0,0,0,0,0,0,0,0,0,0,0,0]
["Decrease (increase) in non-current investments",null,0,0,0,0,0,0,0,0,0,0,0,0,0,0,0]
["Total Cash Receipts by Source",null,{"$f":"SUM(C21:C31)","v":158792417.70999998},{"$f":"SUM(D21:D31)","v":14143664.289999999},20369221.920000002,5097624.93,7805610.6499999994,82335327.200000003,7370911.3399999999,5432193.1200000001,0,27723792,27723792,-24109051.160000004,332685504,389281145,362945414]
["Cash Payments by Type",null,null,null,null,null,null,null,null,null,null,null,null,{"$f":"O33-SUM(C33:M33)","v":0}]
["Employee related costs",null,11555528.130000001,11674008.83,12727442.76,12835003.060000001,10842447.359999999,12226787.119999999,11453009.5,12515006.09,0,10363172.91,10363172.91,4443696.3299999982,120999275,154091518,161715030]
["Remuneration of councillors",null,0,0,0,0,0,0,0,0,0,1338213.25,1338213.25,13589360.5,16265787,17038421,17932938]
["Interest",null,0,0,0,0,0,0,0,0,0,257113.67,257113.67,2571136.66,3085364,3199500,3305084]
["Bulk purchases - Electricity",null,0,0,0,0,0,0,0,0,0,1549400.17,1549400.17,14809009.66,17907810,16148172,16681062]
["Acquisitions - water & other inventory",null,0,0,0,0,0,0,0,0,0,514428.83,514428.83,5144288.34,6173146,6978146,7208425]
[]
["Contracted services",null,0,0,0,0,0,0,0,0,0,5648941,5648941,56489410,67787292,51505541,32902174]
["Transfers and subsidies - other municipalities",null,null,null,null,null,null,null,null,null,null,null,null,0]
["Transfers and subsidies - other",null,null,null,null,null,null,null,null,null,null,null,null,0]
["Other expenditure",null,93994852.329999998,21978803.84,11532330.359999999,8082885.1200000001,3736590.37,89446071.810000002,4615060.29,6925309.0099999998,0,4297671.41,4297671.41,-197335188.94999999,51572057,43963000,59850000]
["Cash Payments by Type",{"$f":"SUM(B34:B43)","v":0},{"$f":"SUM(C34:C43)","v":105550380.45999999},{"$f":"SUM(D34:D43)","v":33652812.670000002},24259773.119999997,20917888.18,14579037.73,101672858.93000001,16068069.789999999,19440315.100000001,0,23968941.239999998,23968941.239999998,-100288287.45999999,283790731,292924298,299594713]
["Other Cash Flows/Payments by Type"]
["Capital assets",null,2763197.56,1954327.73,2016665.24,3591990.8,3843230.48,4433521.51,1594282.5,513610,0,4856416.66,4856416.66,{"$f":"O46-SUM(C46:M46)","v":27853340.859999999},58277000,72919153,45110795]
["Repayment of borrowing",null,0,0,0,0,0,0,0,0,0,0,0,{"$f":"O47-SUM(C47:M47)","v":0},0,0,0]
["Other Cash Flows/Payments",null,0,0,0,0,0,0,9559656.5600000005,0,0,0,0,{"$f":"O48-SUM(C48:M48)","v":-9559656.5600000005},0,0,0]
["Total Cash Payments by Type",{"$f":"SUM(B44:B48)","v":0},108313578.02,35607140.399999999,26276438.359999996,24509878.98,18422268.210000001,106106380.44000001,27222008.850000001,19953925.100000001,0,28825357.899999999,28825357.899999999,-81994603.159999996,342067731,365843451,344705508]
["NET INCREASE/(DECREASE) IN CASH HELD",{"$f":"B32-B49","v":0},50478839.689999983,-21463476.109999999,-5907216.4399999939,-19412254.050000001,-10616657.560000002,-23771053.24000001,-19851097.510000002,-14521731.98,0,-1101565.8999999985,-1101565.8999999985,57885551.999999993,-9382227,23437694,18239906]
["Cash/cash equivalents at the month/year beginning:",null,132645118.40000001,{"$f":"C52","v":183123958.08999997},{"$f":"D52","v":161660481.97999996},155753265.53999996,136341011.48999995,125724353.92999995,101953300.68999994,82102203.179999933,67580471.199999928,67580471.199999928,66478905.29999993,65377339.399999931,{"$f":"C51","v":132645118.40000001},{"$f":"O52","v":123262891.40000001},{"$f":"P52","v":146700585.40000001}]
["Cash/cash equivalents at the month/year end:",null,{"$f":"C50+C51","v":183123958.08999997},{"$f":"D50+D51","v":161660481.97999996},{"$f":"E50+E51","v":155753265.53999996},136341011.48999995,125724353.92999995,101953300.68999994,82102203.179999933,67580471.199999928,67580471.199999928,66478905.29999993,65377339.399999931,123262891.39999992,{"$f":"O50+O51","v":123262891.40000001},{"$f":"P50+P51","v":146700585.40000001},{"$f":"Q50+Q51","v":164940491.40000001}]
[{"$f":"head27a","v":"References"}]
["1. Replace 'budget' heading with adjusted budget, or 'outcome' only for month/s complete"]
["2. Total of monthly amounts must always agree to the approved or adjusted budget"]
["3. Amend 'cash-at-beginning' when prior year actual known (as part of the adjustments budget)"]
[]
[]
[]
[]
[null,null,null,null,{"$f":"E44+E60","v":24259773.119999997},20917888.18,14579037.73,101672858.93000001,16068069.789999999,19440315.100000001,0,23968941.239999998,null,{"$f":"N44+N60","v":-100288287.45999999},{"$f":"O44+O60","v":283790731},{"$f":"P44+P60","v":292924298}]
[null,null,null,null,{"$f":"E50-E60","v":-5907216.4399999939},-19412254.050000001,-10616657.560000002,-23771053.24000001,-19851097.510000002,-14521731.98,0,-1101565.8999999985,{"$f":"M50-M60","v":-1101565.8999999985},{"$f":"N50-N60","v":57885551.999999993},-9382227,23437694]

{"sheet":"SC10","index":25,"n_rows":57,"n_cols":12,"rows_kept":57,"cut":false,"hidden":false,"merged":[[1,0,2,0],[1,1,2,1],[0,0,0,10]]}
[{"$f":"muni& \" - \"&S71P& \" - \"&Head57","v":"LIM353 Molemole - NOT REQUIRED - municipality does not have entities or this is the parent municipality's budget - Q3 Third Quarter"}]
[{"$f":"desc","v":"Description"},{"$f":"head27","v":"Ref"},{"$f":"Head1","v":"2024/25"},{"$f":"Head2","v":"Budget Year 2025/26"}]
[null,null,{"$f":"Head5","v":"Audited Outcome"},{"$f":"Head6","v":"Original Budget"},{"$f":"Head7","v":"Adjusted Budget"},{"$f":"Head38","v":"Monthly actual"},{"$f":"Head39","v":"YearTD actual"},{"$f":"Head40","v":"YearTD budget"},{"$f":"Head41","v":"YTD variance"},{"$f":"Head41","v":"YTD variance"},{"$f":"Head8","v":"Full Year Forecast"}]
["R thousands",1,null,null,null,null,null,null,null,"%"]
["Revenue",null,null,null,null,null,null,null,null,null,null," "]
["Exchange Revenue"]
["Service charges - Electricity ",null,null,null,null,null,null,null,{"$f":"G7-H7","v":0},{"$f":"IF(I7=0,\"\",I7/H7)","v":""}]
["Service charges - Water ",null,null,null,null,null,null,null,0,""]
["Service charges - Waste Water Management",null,null,null,null,null,null,null,0,""]
["Service charges - Waste management",null,null,null,null,null,null,null,0,""]
["Sale of Goods and Rendering of Services",null,null,null,null,null,null,null,{"$f":"G11-H11","v":0},{"$f":"IF(I11=0,\"\",I11/H11)","v":""}]
["Agency services",null,null,null,null,null,null,null,0,""]
["Interest",null,null,null,null,null,null,null,0,""]
["Interest earned from Receivables",null,null,null,null,null,null,null,0,""]
["Interest earned from Current and Non Current Assets",null,null,null,null,null,null,null,{"$f":"G15-H15","v":0},{"$f":"IF(I15=0,\"\",I15/H15)","v":""}]
["Dividends",null,null,null,null,null,null,null,0,""]
["Rent on Land",null,null,null,null,null,null,null,0,""]
["Rental from Fixed Assets",null,null,null,null,null,null,null,0,""]
["Licence and permits",null,null,null,null,null,null,null,0,""]
["Special rating levies",null,null,null,null,null,null,null,0]
["Operational Revenue",null,null,null,null,null,null,null,0,""]
["Non-Exchange Revenue",null,null,null,null,null,null,null,0,""]
["Property rates",null,null,null,null,null,null,null,{"$f":"G23-H23","v":0},{"$f":"IF(I23=0,\"\",I23/H23)","v":""}]
["Surcharges and Taxes",null,null,null,null,null,null,null,0,""]
["Fines, penalties and forfeits",null,null,null,null,null,null,null,0,""]
["Licences or permits",null,null,null,null,null,null,null,0,""]
["Transfer and subsidies - Operational",null,null,null,null,null,null,null,0,""]
["Interest",null,null,null,null,null,null,null,0,""]
["Fuel Levy",null,null,null,null,null,null,null,0,""]
["Operational Revenue",null,null,null,null,null,null,null,0,""]
["Gains on disposal of Assets",null,null,null,null,null,null,null,0,""]
["Other Gains",null,null,null,null,null,null,null,0,""]
["Discontinued Operations",null,null,null,null,null,null,null,0,""]
["Total Revenue (excluding capital transfers and contributions)",null,{"$f":"SUM(C7:C21)+SUM(C23:C33)","v":0},{"$f":"SUM(D7:D21)+SUM(D23:D33)","v":0},0,{"$f":"SUM(F7:F21)+SUM(F23:F33)","v":0},{"$f":"SUM(G7:G21)+SUM(G23:G33)","v":0},{"$f":"SUM(H7:H21)+SUM(H23:H33)","v":0},{"$f":"G34-H34","v":0},"",{"$f":"SUM(K7:K21)+SUM(K23:K33)","v":0}]
["Expenditure By Type"]
["Employee related costs",null,null,null,null,null,null,null,{"$f":"G36-H36","v":0},{"$f":"IF(I36=0,\"\",I36/H36)","v":""}]
["Remuneration of councillors",null,null,null,null,null,null,null,0,""]
["Bulk purchases - electricity",null,null,null,null,null,null,null,0,""]
["Inventory consumed",null,null,null,null,null,null,null,0,""]
["Debt impairment",null,null,null,null,null,null,null,0,""]
["Depreciation and amortisation",null,null,null,null,null,null,null,0,""]
["Interest",null,null,null,null,null,null,null,0,""]
["Contracted services",null,null,null,null,null,null,null,0,""]
["Transfers and subsidies",null,null,null,null,null,null,null,0,""]
["Irrecoverable debts written off",null,null,null,null,null,null,null,0,""]
["Operational costs",null,null,null,null,null,null,null,{"$f":"G46-H46","v":0},{"$f":"IF(I46=0,\"\",I46/H46)","v":""}]
["Losses on disposal of Assets",null,null,null,null,null,null,null,{"$f":"G47-H47","v":0},{"$f":"IF(I47=0,\"\",I47/H47)","v":""}]
["Other Losses",null,null,null,null,null,null,null,0,""]
["Total Expenditure",null,{"$f":"SUM(C36:C48)","v":0},{"$f":"SUM(D36:D48)","v":0},0,0,0,0,0,"",{"$f":"SUM(K36:K48)","v":0}]
["Surplus/(Deficit)",null,{"$f":"C34-C49","v":0},0,0,0,0,0,0,"",{"$f":"K34-K49","v":0}," "]
["Transfers and subsidies - capital (monetary allocations)",null,null,null,null,null,null,null,0,"",null," "]
["Transfers and subsidies - capital (in-kind)",null,null,null,null,null,null,null,0,"",null," "]
["Surplus/(Deficit) after capital transfers & contributions",null,{"$f":"C50+SUM(C51:C52)","v":0},0,0,0,0,0,0,"",{"$f":"K50+SUM(K51:K52)","v":0}," "]
["Income Tax",null,null,null,null,null,null,null,0,"",null," "]
["Surplus/(Deficit) after income tax",null,{"$f":"C53-C54","v":0},0,0,0,0,0,0,"",{"$f":"K53-K54","v":0}]
[{"$f":"head27a","v":"References"}]
["1. Votes (consolidated) are revenue sources and expenditure type"]

{"sheet":"SC11","index":26,"n_rows":49,"n_cols":11,"rows_kept":49,"cut":false,"hidden":false,"merged":[[1,0,2,0],[1,1,2,1],[0,0,0,10],[1,3,1,10]]}
[{"$f":"muni& \" - \"&S71Q& \" - \"&Head57","v":"LIM353 Molemole - NOT REQUIRED - municipality does not have entities or this is the parent municipality's budget - Q3 Third Quarter"}]
[{"$f":"desc","v":"Description"},{"$f":"head27","v":"Ref"},{"$f":"Head1","v":"2024/25"},{"$f":"Head2","v":"Budget Year 2025/26"}]
[null,null,{"$f":"Head5","v":"Audited Outcome"},{"$f":"Head6","v":"Original Budget"},{"$f":"Head7","v":"Adjusted Budget"},{"$f":"Head38","v":"Monthly actual"},{"$f":"Head39","v":"YearTD actual"},{"$f":"Head40","v":"YearTD budget"},{"$f":"Head41","v":"YTD variance"},{"$f":"Head41","v":"YTD variance"},{"$f":"Head8","v":"Full Year Forecast"}]
["R thousands",null,null,null,null,null,null,null,null,"%"]
["Revenue By Municipal Entity"]
["Insert name of municipal entity",null,null,null,null,null,null,null,{"$f":"G6-H6","v":0},{"$f":"IF(I6=0,\"\",I6/H6)","v":""}]
[null,null,null,null,null,null,null,null,0,{"$f":"IF(I7=0,\"\",I7/H7)","v":""}]
[null,null,null,null,null,null,null,null,0,""]
[null,null,null,null,null,null,null,null,0,""]
[null,null,null,null,null,null,null,null,0,""]
[null,null,null,null,null,null,null,null,0,""]
[null,null,null,null,null,null,null,null,0,""]
[null,null,null,null,null,null,null,null,0,""]
[null,null,null,null,null,null,null,null,0,""]
[null,null,null,null,null,null,null,null,0,""]
["Total Operating Revenue",1,{"$f":"SUM(C6:C15)","v":0},0,0,0,0,0,0,"",{"$f":"SUM(K6:K15)","v":0}]
[]
["Expenditure By Municipal Entity"]
[{"$f":"A6","v":"Insert name of municipal entity"},null,null,null,null,null,null,null,0,{"$f":"IF(I19=0,\"\",I19/H19)","v":""}]
[{"$f":"IF(A7=\"\",\"\",A7)","v":""},null,null,null,null,null,null,null,0,""]
[{"$f":"IF(A8=\"\",\"\",A8)","v":""},null,null,null,null,null,null,null,0,""]
["",null,null,null,null,null,null,null,0,""]
["",null,null,null,null,null,null,null,0,""]
["",null,null,null,null,null,null,null,0,""]
["",null,null,null,null,null,null,null,0,""]
["",null,null,null,null,null,null,null,0,""]
["",null,null,null,null,null,null,null,0,""]
["",null,null,null,null,null,null,null,0,""]
["Total Operating Expenditure",2,{"$f":"SUM(C19:C28)","v":0},0,0,0,0,0,0,"",{"$f":"SUM(K19:K28)","v":0}]
[null,null,null,null,null,null,null,null,null,""]
[{"$f":"Head42","v":"Surplus/ (Deficit) for the yr/period"},null,{"$f":"C16-C29","v":0},{"$f":"D16-D29","v":0},0,0,0,0,{"$f":"I16+I29","v":0},"",0]
["Capital Expenditure By Municipal Entity"]
[{"$f":"$A$6","v":"Insert name of municipal entity"},null,null,null,null,null,null,null,0,""]
[{"$f":"IF(A7=\"\",\"\",A7)","v":""},null,null,null,null,null,null,null,0,""]
[{"$f":"IF(A8=\"\",\"\",A8)","v":""},null,null,null,null,null,null,null,0,""]
["",null,null,null,null,null,null,null,0,""]
["",null,null,null,null,null,null,null,0,""]
["",null,null,null,null,null,null,null,0,""]
["",null,null,null,null,null,null,null,0,""]
["",null,null,null,null,null,null,null,0,""]
["",null,null,null,null,null,null,null,0,""]
[null,null,null,null,null,null,null,null,null,""]
["Total Capital Expenditure",3,{"$f":"SUM(C32:C42)","v":0},{"$f":"SUM(D32:D42)","v":0},0,0,0,{"$f":"SUM(H32:H42)","v":0},{"$f":"G43-H43","v":0},"",0]
[{"$f":"head27a","v":"References"}]
["1. Must reconcile to the sum of all municipal entity monthly revenue reports"]
["2. Must reconcile to the sum of all municipal entity monthly expenditure reports"]
["3. YTD = Year to date; FAV - favourable variance or unfavourable variance"]
["4. Material variances to be explained"]
["5. Insert additional 'Adjustment' Budget column for each Adjustment made by an entity"]

{"sheet":"SC12","index":27,"n_rows":18,"n_cols":10,"rows_kept":18,"cut":false,"hidden":false,"merged":[[1,0,2,0],[0,0,0,9],[1,2,1,9]]}
[{"$f":"muni& \" - \"&S71R& \" - \"&Head57","v":"LIM353 Molemole - Supporting Table SC12 Monthly Budget Statement - capital expenditure trend - Q3 Third Quarter"}]
["Month",{"$f":"Head1","v":"2024/25"},{"$f":"Head2","v":"Budget Year 2025/26"}]
[null,{"$f":"Head5","v":"Audited Outcome"},{"$f":"Head6","v":"Original Budget"},{"$f":"Head7","v":"Adjusted Budget"},{"$f":"Head38","v":"Monthly actual"},{"$f":"Head39","v":"YearTD actual"},{"$f":"Head40","v":"YearTD budget"},{"$f":"Head41","v":"YTD variance"},{"$f":"Head41","v":"YTD variance"},"% spend of Original Budget"]
["R thousands",null,null,null,null,null,null,null,"%"]
["Monthly expenditure performance trend"]
["July",0,5366405,5366405,2763197.56,{"$f":"IF(E6>0,E6,0)","v":2763197.56},{"$f":"IF(D6>0,D6,C6)","v":5366405},{"$f":"IF(F6=\"\",0,G6-F6)","v":2603207.44},{"$f":"IF(F6=\"\",\"\",IF(H6=0,\"\",H6/G6))","v":0.48509336138439046},{"$f":"IF(F6=\"\",\"\",F6/$C$18)","v":4.7414890265456353E-2}]
["August",1448489.35,5366405,5366405,1954327.73,1954327.73,{"$f":"IF(D7>0,D7+D6,C7+C6)","v":10732810},8778482.2699999996,0.81791089845063869,3.3535146455720095E-2]
["September",2352886.2999999998,5366405,5366405,2016665.24,2016665.24,{"$f":"IF(D8>0,D8+G7,C8+G7)","v":16099215},14082549.76,0.87473518180855403,3.4604822485714774E-2]
["October",3737538.1,5366405,5366405,3591990.8,3591990.8,{"$f":"IF(D9>0,D9+G8,C9+G8)","v":21465620},17873629.199999999,0.83266307705065123,6.1636508399540123E-2]
["November",5391676.1500000004,5366405,5366405,3843230.48,3843230.48,26832025,22988794.52,0.85676703565981316,6.5947637661513112E-2]
["December",14131727.09,5366405,5366405,4433521.51,4433521.51,32198430,27764908.490000002,0.86230628294609402,7.6076694236148046E-2]
["January",2785465.22,5366405,5366405,1594282.5,1594282.5,37564835,35970552.5,0.95755917735296858,2.7356976165554162E-2]
["February",6699599.0300000003,4142445,4142445,513610,513610,41707280,41193670,0.9876853633226621,8.8132539423786405E-3]
["March",948191.1,4142445,4142445,14105735.5,14105735.5,45849725,31743989.5,0.69234852553641268,0.24204635619541157]
["April",7053021.5800000001,4142445,4142445,0,0,49992170,49992170,1,0]
["May",3110574,4142445,4142445,0,{"$f":"IF(E15>0,E15,0)","v":0},54134615,54134615,1,0]
["June",4024671.57,4142385,4142385,0,{"$f":"IF(E17>0,E17,0)","v":0},58277000,{"$f":"IF(F17=\"\",0,G17-F17)","v":58277000},{"$f":"IF(F17=\"\",\"\",IF(H17=0,\"\",H17/G17))","v":1},{"$f":"IF(F17=\"\",\"\",F17/$C$18)","v":0}]
["Total Capital expenditure",{"$f":"SUM(B6:B17)","v":51683839.490000002},{"$f":"SUM(C6:C17)","v":58277000},{"$f":"SUM(D6:D17)","v":58277000},{"$f":"SUM(E6:E17)","v":34816561.32}]

{"sheet":"SC13a","index":28,"n_rows":178,"n_cols":11,"rows_kept":178,"cut":false,"hidden":false,"merged":[[1,0,2,0],[1,1,2,1],[0,0,0,10]]}
[{"$f":"muni& \" - \"&S71Sa& \" - \"&Head57","v":"LIM353 Molemole - Supporting Table SC13a Monthly Budget Statement - capital expenditure on new assets by asset class - Q3 Third Quarter"}]
[{"$f":"desc","v":"Description"},{"$f":"head27","v":"Ref"},{"$f":"Head1","v":"2024/25"},{"$f":"Head2","v":"Budget Year 2025/26"}]
[null,null,{"$f":"Head5","v":"Audited Outcome"},{"$f":"Head6","v":"Original Budget"},{"$f":"Head7","v":"Adjusted Budget"},{"$f":"Head38","v":"Monthly actual"},{"$f":"Head39","v":"YearTD actual"},{"$f":"Head40","v":"YearTD budget"},{"$f":"Head41","v":"YTD variance"},{"$f":"Head41","v":"YTD variance"},{"$f":"Head8","v":"Full Year Forecast"}]
["R thousands",1,null,null,null,null,null,null,null,"%"]
["Capital expenditure on new assets by Asset Class/Sub-class"]
[]
["Infrastructure",null,{"$f":"C8+C13+C17+C27+C38+C45+C53+C63+C69","v":35251195.159999996},44488000,40888000,14128351.5,34028316.539999999,31926006,{"$f":"H7-G7","v":-2102310.5399999991},{"$f":"IF(I7=0,\"\",I7/H7)","v":-6.5849468925113869E-2},{"$f":"K8+K13+K17+K27+K38+K45+K53+K63+K69","v":40888000}]
["Roads Infrastructure",null,{"$f":"SUM(C9:C12)","v":9483235.0299999993},21803670,37540826,341851.5,18899664.289999999,22647619.399999999,3747955.1099999994,0.16549002541079438,{"$f":"SUM(K9:K12)","v":37540826}]
["Roads",null,9432235.0299999993,21803670,37540826,341851.5,18899664.289999999,22647619.399999999,3747955.1099999994,0.16549002541079438,37540826]
["Road Structures",null,0,0,0,0,0,0,0,"",0]
["Road Furniture",null,51000,0,0,0,0,0,0,"",0]
["Capital Spares",null,null,null,null,null,null,null,0,""]
["Storm water Infrastructure",null,{"$f":"SUM(C14:C16)","v":0},0,0,0,0,0,0,"",{"$f":"SUM(K14:K16)","v":0}]
["Drainage Collection",null,null,null,null,null,null,null,0,""]
["Storm water Conveyance",null,0,0,0,0,0,0,0,"",0]
["Attenuation",null,null,null,null,null,null,null,0,""]
["Electrical Infrastructure",null,{"$f":"SUM(C18:C26)","v":2636085},3600000,0,13786500,13786500,1260000,-12526500,-9.9416666666666664,{"$f":"SUM(K18:K26)","v":0}]
["Power Plants",null,null,null,null,null,null,null,0,""]
["HV Substations",null,null,null,null,null,null,null,0,""]
["HV Switching Station",null,null,null,null,null,null,null,0,""]
["HV Transmission Conductors",null,null,null,null,null,null,null,0,""]
["MV Substations",null,0,0,0,0,0,0,0,"",0]
["MV Switching Stations",null,null,null,null,null,null,null,0,""]
["MV Networks",null,869565,0,0,0,0,0,0,"",0]
["LV Networks",null,1766520,3600000,0,13786500,13786500,1260000,-12526500,-9.9416666666666664,0]
["Capital Spares",null,null,null,null,null,null,null,0,""]
["Water Supply Infrastructure",null,{"$f":"SUM(C28:C37)","v":0},0,0,0,0,0,0,"",{"$f":"SUM(K28:K37)","v":0}]
["Dams and Weirs",null,null,null,null,null,null,null,0,""]
["Boreholes",null,null,null,null,null,null,null,0,""]
["Reservoirs",null,null,null,null,null,null,null,0,""]
["Pump Stations",null,null,null,null,null,null,null,0,""]
["Water Treatment Works",null,null,null,null,null,null,null,0,""]
["Bulk Mains",null,null,null,null,null,null,null,0,""]
["Distribution",null,null,null,null,null,null,null,0,""]
["Distribution Points",null,null,null,null,null,null,null,0,""]
["PRV Stations",null,null,null,null,null,null,null,0,""]
["Capital Spares",null,null,null,null,null,null,null,0,""]
["Sanitation Infrastructure",null,{"$f":"SUM(C39:C44)","v":0},0,0,0,0,0,0,"",{"$f":"SUM(K39:K44)","v":0}]
["Pump Station",null,null,null,null,null,null,null,0,""]
["Reticulation",null,null,null,null,null,null,null,{"$f":"H40-G40","v":0},{"$f":"IF(I40=0,\"\",I40/H40)","v":""}]
["Waste Water Treatment Works",null,null,null,null,null,null,null,{"$f":"H41-G41","v":0},{"$f":"IF(I41=0,\"\",I41/H41)","v":""}]
["Outfall Sewers",null,null,null,null,null,null,null,{"$f":"H42-G42","v":0},{"$f":"IF(I42=0,\"\",I42/H42)","v":""}]
["Toilet Facilities",null,null,null,null,null,null,null,0,""]
["Capital Spares",null,null,null,null,null,null,null,0,""]
["Solid Waste Infrastructure",null,{"$f":"SUM(C46:C52)","v":23131875.129999999},19084330,3347174,0,1342152.25,8018386.5999999996,6676234.3499999996,0.83261567233488087,{"$f":"SUM(K46:K52)","v":3347174}]
["Landfill Sites",null,23131875.129999999,19084330,3347174,0,1342152.25,8018386.5999999996,6676234.3499999996,0.83261567233488087,3347174]
["Waste Transfer Stations",null,null,null,null,null,null,null,0,""]
["Waste Processing Facilities",null,null,null,null,null,null,null,{"$f":"H48-G48","v":0},{"$f":"IF(I48=0,\"\",I48/H48)","v":""}]
["Waste Drop-off Points",null,null,null,null,null,null,null,0,""]
["Waste Separation Facilities",null,null,null,null,null,null,null,0,""]
["Electricity Generation Facilities",null,null,null,null,null,null,null,0,""]
["Capital Spares",null,null,null,null,null,null,null,0,""]
["Rail Infrastructure",null,{"$f":"SUM(C54:C62)","v":0},0,0,0,0,0,0,"",{"$f":"SUM(K54:K62)","v":0}]
["Rail Lines",null,null,null,null,null,null,null,0,""]
["Rail Structures",null,null,null,null,null,null,null,0,""]
["Rail Furniture",null,null,null,null,null,null,null,0,""]
["Drainage Collection",null,null,null,null,null,null,null,0,""]
["Storm water Conveyance",null,null,null,null,null,null,null,0,""]
["Attenuation",null,null,null,null,null,null,null,0,""]
["MV Substations",null,null,null,null,null,null,null,0,""]
["LV Networks",null,null,null,null,null,null,null,0,""]
["Capital Spares",null,null,null,null,null,null,null,0,""]
["Coastal Infrastructure",null,{"$f":"SUM(C64:C68)","v":0},0,0,0,0,0,0,"",{"$f":"SUM(K64:K68)","v":0}]
["Sand Pumps",null,null,null,null,null,null,null,0,""]
["Piers",null,null,null,null,null,null,null,0,""]
["Revetments",null,null,null,null,null,null,null,0,""]
["Promenades",null,null,null,null,null,null,null,0,""]
["Capital Spares",null,null,null,null,null,null,null,0,""]
["Information and Communication Infrastructure",null,{"$f":"SUM(C70:C73)","v":0},0,0,0,0,0,{"$f":"H69-G69","v":0},"",{"$f":"SUM(K70:K73)","v":0}]
["Data Centres",null,null,null,null,null,null,null,{"$f":"H70-G70","v":0},""]
["Core Layers",null,null,null,null,null,null,null,{"$f":"H71-G71","v":0},{"$f":"IF(I71=0,\"\",I71/H71)","v":""}]
["Distribution Layers",null,null,null,null,null,null,null,{"$f":"H72-G72","v":0},""]
["Capital Spares",null,null,null,null,null,null,null,{"$f":"H73-G73","v":0},""]
[null,null,null,null,null,null,null,null,null,""]
["Community Assets",null,{"$f":"+C76+C99","v":0},12700000,12200000,0,130434.78,9325015,{"$f":"H75-G75","v":9194580.2200000007},0.98601237853236701,{"$f":"+K76+K99","v":12200000}]
["Community Facilities",null,{"$f":"SUM(C77:C98)","v":0},1500000,1000000,0,0,925009,{"$f":"H76-G76","v":925009},1,{"$f":"SUM(K77:K98)","v":1000000}]
["Halls",null,null,null,null,null,null,null,0,""]
["Centres",null,null,null,null,null,null,null,0,""]
["Crèches",null,null,null,null,null,null,null,0,""]
["Clinics/Care Centres",null,null,null,null,null,null,null,0,""]
["Fire/Ambulance Stations",null,null,null,null,null,null,null,0,""]
["Testing Stations",null,0,1500000,1000000,0,0,925009,925009,1,1000000]
["Museums",null,null,null,null,null,null,null,0,""]
["Galleries",null,null,null,null,null,null,null,0,""]
["Theatres",null,null,null,null,null,null,null,0,""]
["Libraries",null,null,null,null,null,null,null,0,""]
["Cemeteries/Crematoria",null,null,null,null,null,null,null,0,""]
["Police",null,null,null,null,null,null,null,0,""]
["Purls",null,null,null,null,null,null,null,0,""]
["Public Open Space",null,0,0,0,0,0,0,0,"",0]
["Nature Reserves",null,null,null,null,null,null,null,0,""]
["Public Ablution Facilities",null,null,null,null,null,null,null,0,""]
["Markets",null,null,null,null,null,null,null,0,""]
["Stalls",null,null,null,null,null,null,null,0,""]
["Abattoirs",null,null,null,null,null,null,null,0,""]
["Airports",null,null,null,null,null,null,null,0,""]
["Taxi Ranks/Bus Terminals",null,null,null,null,null,null,null,0,""]
["Capital Spares",null,null,null,null,null,null,null,0,""]
["Sport and Recreation Facilities",null,{"$f":"SUM(C100:C102)","v":0},11200000,11200000,0,130434.78,8400006,8269571.2199999997,0.98447206109138485,{"$f":"SUM(K100:K102)","v":11200000}]
["Indoor Facilities",null,0,11200000,11200000,0,130434.78,8400006,8269571.2199999997,0.98447206109138485,11200000]
["Outdoor Facilities",null,null,null,null,null,null,null,0,""]
["Capital Spares",null,null,null,null,null,null,null,0,""]
["Heritage assets",null,{"$f":"SUM(C104:C108)","v":0},0,0,0,0,0,0,"",{"$f":"SUM(K104:K108)","v":0}]
["Monuments",null,null,null,null,null,null,null,0,""]
["Historic Buildings",null,null,null,null,null,null,null,0,""]
["Works of Art",null,null,null,null,null,null,null,0,""]
["Conservation Areas",null,null,null,null,null,null,null,0,""]
["Other Heritage",null,null,null,null,null,null,null,0,""]
[null,null,null,null,null,null,null,null,0,""]
["Investment properties",null,{"$f":"+C111+C114","v":0},0,0,0,0,0,0,"",{"$f":"+K111+K114","v":0}]
["Revenue Generating",null,{"$f":"SUM(C112:C113)","v":0},0,0,0,0,0,0,"",{"$f":"SUM(K112:K113)","v":0}]
["Improved Property",null,null,null,null,null,null,null,0,""]
["Unimproved Property",null,null,null,null,null,null,null,0,""]
["Non-revenue Generating",null,{"$f":"SUM(C115:C116)","v":0},0,0,0,0,0,0,"",{"$f":"SUM(K115:K116)","v":0}]
["Improved Property",null,null,null,null,null,null,null,0,""]
["Unimproved Property",null,null,null,null,null,null,null,0,""]
["Other assets",null,{"$f":"+C118+C130","v":0},1350000,0,0,0,472500,472500,1,{"$f":"+K118+K130","v":0}]
["Operational Buildings",null,{"$f":"SUM(C119:C129)","v":0},1350000,0,0,0,472500,472500,1,{"$f":"SUM(K119:K129)","v":0}]
["Municipal Offices",null,0,1350000,0,0,0,472500,472500,1,0]
["Pay/Enquiry Points",null,null,null,null,null,null,null,0,""]
["Building Plan Offices",null,null,null,null,null,null,null,0,""]
["Workshops",null,0,0,0,0,0,0,0,"",0]
["Yards",null,null,null,null,null,null,null,0,""]
["Stores",null,null,null,null,null,null,null,0,""]
["Laboratories",null,null,null,null,null,null,null,0,""]
["Training Centres",null,null,null,null,null,null,null,0,""]
["Manufacturing Plant",null,null,null,null,null,null,null,0,""]
["Depots",null,null,null,null,null,null,null,0,""]
["Capital Spares",null,null,null,null,null,null,null,0,""]
["Housing",null,{"$f":"SUM(C131:C133)","v":0},0,0,0,0,0,0,"",{"$f":"SUM(K131:K133)","v":0}]
["Staff Housing",null,null,null,null,null,null,null,0,""]
["Social Housing",null,null,null,null,null,null,null,0,""]
["Capital Spares",null,null,null,null,null,null,null,0,""]
[null,null,null,null,null,null,null,null,null,""]
["Biological or Cultivated Assets",null,{"$f":"SUM(C136:C136)","v":0},0,0,0,0,0,{"$f":"H135-G135","v":0},{"$f":"IF(I135=0,\"\",I135/H135)","v":""},{"$f":"SUM(K136)","v":0}]
["Biological or Cultivated Assets",null,null,null,null,null,null,null,{"$f":"H136-G136","v":0},""]
[null,null,null,null,null,null,null,null,null,""]
["Intangible Assets",null,{"$f":"SUM(C139:C140)","v":2976569.26},0,0,0,0,0,{"$f":"H138-G138","v":0},"",{"$f":"SUM(K139:K140)","v":0}]
["Servitudes",null,null,null,null,null,null,null,0,""]
["Licences and Rights",null,{"$f":"SUM(C141:C146)","v":2976569.26},0,0,0,0,0,0,"",{"$f":"SUM(K141:K146)","v":0}]
["Water Rights",null,null,null,null,null,null,null,0,""]
["Effluent Licenses",null,null,null,null,null,null,null,0,""]
["Solid Waste Licenses",null,null,null,null,null,null,null,0,""]
["Computer Software and Applications",null,2976569.26,0,0,0,0,0,0,"",0]
["Load Settlement Software Applications",null,null,null,null,null,null,null,0,""]
["Unspecified",null,null,null,null,null,null,null,0,""]
[]
["Computer Equipment",null,{"$f":"SUM(C149:C149)","v":2253865},600000,429000,0,29000,381600,{"$f":"H148-G148","v":352600},{"$f":"IF(I148=0,\"\",I148/H148)","v":0.92400419287211744},{"$f":"SUM(K149)","v":429000}]
["Computer Equipment",null,2253865,600000,429000,0,29000,381600,{"$f":"H149-G149","v":352600},{"$f":"IF(I149=0,\"\",I149/H149)","v":0.92400419287211744},429000]
[]
["Furniture and Office Equipment",null,{"$f":"SUM(C152:C152)","v":325786.28999999998},250000,250000,0,24860,187506,{"$f":"H151-G151","v":162646},{"$f":"IF(I151=0,\"\",I151/H151)","v":0.8674175759709023},{"$f":"SUM(K152)","v":250000}]
["Furniture and Office Equipment",null,325786.28999999998,250000,250000,0,24860,187506,{"$f":"H152-G152","v":162646},{"$f":"IF(I152=0,\"\",I152/H152)","v":0.8674175759709023},250000]
[null,null,null,null,null,null,null,null,null,{"$f":"IF(I153=0,\"\",I153/H153)","v":""}]
["Machinery and Equipment",null,{"$f":"SUM(C155:C155)","v":10530640.58},1650000,1650000,-22616,603950,1237509,{"$f":"H154-G154","v":633559},{"$f":"IF(I154=0,\"\",I154/H154)","v":0.51196314531853915},{"$f":"SUM(K155)","v":1650000}]
["Machinery and Equipment",null,10530640.58,1650000,1650000,-22616,603950,1237509,{"$f":"H155-G155","v":633559},{"$f":"IF(I155=0,\"\",I155/H155)","v":0.51196314531853915},1650000]
[]
["Transport Assets",null,{"$f":"SUM(C158:C158)","v":0},2800000,2800000,0,0,2100006,{"$f":"H157-G157","v":2100006},{"$f":"IF(I157=0,\"\",I157/H157)","v":1},{"$f":"SUM(K158)","v":2800000}]
["Transport Assets",null,0,2800000,2800000,0,0,2100006,{"$f":"H158-G158","v":2100006},{"$f":"IF(I158=0,\"\",I158/H158)","v":1},2800000]
[]
["Land",null,{"$f":"SUM(C161:C161)","v":0},0,0,0,0,0,{"$f":"H160-G160","v":0},{"$f":"IF(I160=0,\"\",I160/H160)","v":""},{"$f":"SUM(K161)","v":0}]
["Land",null,null,null,null,null,null,null,{"$f":"H161-G161","v":0},{"$f":"IF(I161=0,\"\",I161/H161)","v":""}]
[]
["Zoo's, Marine and Non-biological Animals",null,{"$f":"SUM(C164:C164)","v":0},0,0,0,0,0,{"$f":"H163-G163","v":0},{"$f":"IF(I163=0,\"\",I163/H163)","v":""},{"$f":"SUM(K164)","v":0}]
["Zoo's, Marine and Non-biological Animals",null,null,null,null,null,null,null,{"$f":"H164-G164","v":0},{"$f":"IF(I164=0,\"\",I164/H164)","v":""}]
[]
["Living resources",null,{"$f":"+C167+C170","v":0},0,0,0,0,0,{"$f":"H166-G166","v":0},{"$f":"IF(I166=0,\"\",I166/H166)","v":""},0]
["Mature",null,{"$f":"+C168+C169","v":0},0,0,0,0,0,0,"",0]
["Policing and Protection",null,null,null,null,null,null,null,0,""]
["Zoological plants and animals",null,null,null,null,null,null,null,0,""]
["Immature",null,{"$f":"+C171+C172","v":0},{"$f":"+D171+D172","v":0},0,0,0,0,0,"",{"$f":"+K171+K172","v":0}]
["Policing and Protection",null,null,null,null,null,null,null,0,""]
["Zoological plants and animals",null,null,null,null,null,null,null,0,""]
["Total Capital Expenditure on new assets",1,{"$f":"C7+C75+C103+C110+C117+C135+C138+C148+C151+C154+C157+C160+C163+C166","v":51338056.289999992},63838000,58217000,14105735.5,34816561.32,45630142,{"$f":"H173-G173","v":10813580.68},{"$f":"IF(I173=0,\"\",I173/H173)","v":0.2369832791666526},{"$f":"K7+K75+K103+K110+K117+K135+K138+K148+K151+K154+K157+K160+K163+K166","v":58217000}]
[]
[{"$f":"head27a","v":"References"}]
["1. Total Capital Expenditure on new assets (SC13a) plus Total Capital Expenditure on renewal of existing assets (SC13b) plus Total Capital Expenditure on upgrading of existing assets (SC13e)  must reconcile to total capital expenditure in Table C5"]
[]
["check balance",null,{"$f":"C173+SC13b!C173+SC13e!C173-'C5-Capex'!C40","v":0},{"$f":"D173+SC13b!D173+SC13e!D173-'C5-Capex'!D40","v":0},{"$f":"E173+SC13b!E173+SC13e!E173-'C5-Capex'!E40","v":0},{"$f":"F173+SC13b!F173+SC13e!F173-'C5-Capex'!F40","v":0},{"$f":"G173+SC13b!G173+SC13e!G173-'C5-Capex'!G40","v":0},{"$f":"H173+SC13b!H173+SC13e!H173-'C5-Capex'!H40","v":0},null,null,{"$f":"K173+SC13b!K173+SC13e!K173-'C5-Capex'!K40","v":0}]

{"sheet":"SC13b","index":29,"n_rows":178,"n_cols":11,"rows_kept":178,"cut":false,"hidden":false,"merged":[[0,0,0,10],[1,0,2,0],[1,1,2,1]]}
[{"$f":"muni& \" - \"&S71Sb& \" - \"&Head57","v":"LIM353 Molemole - Supporting Table SC13b Monthly Budget Statement - capital expenditure on renewal of existing assets by asset class - Q3 Third Quarter"}]
[{"$f":"desc","v":"Description"},{"$f":"head27","v":"Ref"},{"$f":"Head1","v":"2024/25"},{"$f":"Head2","v":"Budget Year 2025/26"}]
[null,null,{"$f":"Head5","v":"Audited Outcome"},{"$f":"Head6","v":"Original Budget"},{"$f":"Head7","v":"Adjusted Budget"},{"$f":"Head38","v":"Monthly actual"},{"$f":"Head39","v":"YearTD actual"},{"$f":"Head40","v":"YearTD budget"},{"$f":"Head41","v":"YTD variance"},{"$f":"Head41","v":"YTD variance"},{"$f":"Head8","v":"Full Year Forecast"}]
["R thousands",1,null,null,null,null,null,null,null,"%"]
["Capital expenditure on renewal of existing assets by Asset Class/Sub-class"]
[]
["Infrastructure",null,{"$f":"C8+C13+C17+C27+C38+C45+C53+C63+C69","v":0},0,0,0,0,0,{"$f":"H7-G7","v":0},{"$f":"IF(I7=0,\"\",I7/H7)","v":""},{"$f":"K8+K13+K17+K27+K38+K45+K53+K63+K69","v":0}]
["Roads Infrastructure",null,{"$f":"SUM(C9:C12)","v":0},0,0,0,0,0,0,"",{"$f":"SUM(K9:K12)","v":0}]
["Roads",null,0,0,0,0,0,0,0,"",0]
["Road Structures",null,null,null,null,null,null,null,0,""]
["Road Furniture",null,null,null,null,null,null,null,0,""]
["Capital Spares",null,null,null,null,null,null,null,0,""]
["Storm water Infrastructure",null,{"$f":"SUM(C14:C16)","v":0},0,0,0,0,0,0,"",{"$f":"SUM(K14:K16)","v":0}]
["Drainage Collection",null,null,null,null,null,null,null,0,""]
["Storm water Conveyance",null,null,null,null,null,null,null,0,""]
["Attenuation",null,null,null,null,null,null,null,0,""]
["Electrical Infrastructure",null,{"$f":"SUM(C18:C26)","v":0},0,0,0,0,0,0,"",{"$f":"SUM(K18:K26)","v":0}]
["Power Plants",null,null,null,null,null,null,null,0,""]
["HV Substations",null,null,null,null,null,null,null,0,""]
["HV Switching Station",null,null,null,null,null,null,null,0,""]
["HV Transmission Conductors",null,null,null,null,null,null,null,0,""]
["MV Substations",null,null,null,null,null,null,null,0,""]
["MV Switching Stations",null,null,null,null,null,null,null,0,""]
["MV Networks",null,null,null,null,null,null,null,0,""]
["LV Networks",null,0,0,0,0,0,0,0,"",0]
["Capital Spares",null,null,null,null,null,null,null,0,""]
["Water Supply Infrastructure",null,{"$f":"SUM(C28:C37)","v":0},0,0,0,0,0,0,"",{"$f":"SUM(K28:K37)","v":0}]
["Dams and Weirs",null,null,null,null,null,null,null,0,""]
["Boreholes",null,null,null,null,null,null,null,0,""]
["Reservoirs",null,null,null,null,null,null,null,0,""]
["Pump Stations",null,null,null,null,null,null,null,0,""]
["Water Treatment Works",null,null,null,null,null,null,null,0,""]
["Bulk Mains",null,null,null,null,null,null,null,0,""]
["Distribution",null,null,null,null,null,null,null,0,""]
["Distribution Points",null,null,null,null,null,null,null,0,""]
["PRV Stations",null,null,null,null,null,null,null,0,""]
["Capital Spares",null,null,null,null,null,null,null,0,""]
["Sanitation Infrastructure",null,{"$f":"SUM(C39:C44)","v":0},0,0,0,0,0,0,"",{"$f":"SUM(K39:K44)","v":0}]
["Pump Station",null,null,null,null,null,null,null,0,""]
["Reticulation",null,null,null,null,null,null,null,0,""]
["Waste Water Treatment Works",null,null,null,null,null,null,null,0,""]
["Outfall Sewers",null,null,null,null,null,null,null,0,""]
["Toilet Facilities",null,null,null,null,null,null,null,0,""]
["Capital Spares",null,null,null,null,null,null,null,0,""]
["Solid Waste Infrastructure",null,{"$f":"SUM(C46:C52)","v":0},0,0,0,0,0,0,"",{"$f":"SUM(K46:K52)","v":0}]
["Landfill Sites",null,null,null,null,null,null,null,0,""]
["Waste Transfer Stations",null,null,null,null,null,null,null,0,""]
["Waste Processing Facilities",null,null,null,null,null,null,null,0,""]
["Waste Drop-off Points",null,null,null,null,null,null,null,0,""]
["Waste Separation Facilities",null,null,null,null,null,null,null,0,""]
["Electricity Generation Facilities",null,null,null,null,null,null,null,0,""]
["Capital Spares",null,null,null,null,null,null,null,0,""]
["Rail Infrastructure",null,{"$f":"SUM(C54:C62)","v":0},0,0,0,0,0,0,"",{"$f":"SUM(K54:K62)","v":0}]
["Rail Lines",null,null,null,null,null,null,null,0,""]
["Rail Structures",null,null,null,null,null,null,null,0,""]
["Rail Furniture",null,null,null,null,null,null,null,0,""]
["Drainage Collection",null,null,null,null,null,null,null,0,""]
["Storm water Conveyance",null,null,null,null,null,null,null,0,""]
["Attenuation",null,null,null,null,null,null,null,0,""]
["MV Substations",null,null,null,null,null,null,null,0,""]
["LV Networks",null,null,null,null,null,null,null,0,""]
["Capital Spares",null,null,null,null,null,null,null,0,""]
["Coastal Infrastructure",null,{"$f":"SUM(C64:C68)","v":0},0,0,0,0,0,0,"",{"$f":"SUM(K64:K68)","v":0}]
["Sand Pumps",null,null,null,null,null,null,null,0,""]
["Piers",null,null,null,null,null,null,null,0,""]
["Revetments",null,null,null,null,null,null,null,0,""]
["Promenades",null,null,null,null,null,null,null,0,""]
["Capital Spares",null,null,null,null,null,null,null,0,""]
["Information and Communication Infrastructure",null,{"$f":"SUM(C70:C73)","v":0},0,0,0,0,0,0,"",{"$f":"SUM(K70:K73)","v":0}]
["Data Centres",null,null,null,null,null,null,null,0,""]
["Core Layers",null,null,null,null,null,null,null,0,""]
["Distribution Layers",null,null,null,null,null,null,null,0,""]
["Capital Spares",null,null,null,null,null,null,null,0,""]
[null,null,null,null,null,null,null,null,null,""]
["Community Assets",null,{"$f":"+C76+C99","v":0},0,0,0,0,0,0,"",{"$f":"+K76+K99","v":0}]
["Community Facilities",null,{"$f":"SUM(C77:C98)","v":0},0,0,0,0,0,0,"",{"$f":"SUM(K77:K98)","v":0}]
["Halls",null,null,null,null,null,null,null,0,""]
["Centres",null,null,null,null,null,null,null,0,""]
["Crèches",null,null,null,null,null,null,null,0,""]
["Clinics/Care Centres",null,null,null,null,null,null,null,0,""]
["Fire/Ambulance Stations",null,null,null,null,null,null,null,0,""]
["Testing Stations",null,null,null,null,null,null,null,0,""]
["Museums",null,null,null,null,null,null,null,0,""]
["Galleries",null,null,null,null,null,null,null,0,""]
["Theatres",null,null,null,null,null,null,null,0,""]
["Libraries",null,null,null,null,null,null,null,0,""]
["Cemeteries/Crematoria",null,null,null,null,null,null,null,0,""]
["Police",null,null,null,null,null,null,null,0,""]
["Purls",null,null,null,null,null,null,null,0,""]
["Public Open Space",null,null,null,null,null,null,null,0,""]
["Nature Reserves",null,null,null,null,null,null,null,0,""]
["Public Ablution Facilities",null,null,null,null,null,null,null,0,""]
["Markets",null,null,null,null,null,null,null,0,""]
["Stalls",null,null,null,null,null,null,null,0,""]
["Abattoirs",null,null,null,null,null,null,null,0,""]
["Airports",null,null,null,null,null,null,null,0,""]
["Taxi Ranks/Bus Terminals",null,null,null,null,null,null,null,0,""]
["Capital Spares",null,null,null,null,null,null,null,0,""]
["Sport and Recreation Facilities",null,{"$f":"SUM(C100:C102)","v":0},0,0,0,0,0,0,"",{"$f":"SUM(K100:K102)","v":0}]
["Indoor Facilities",null,0,0,0,0,0,0,0,"",0]
["Outdoor Facilities",null,0,0,0,0,0,0,{"$f":"H101-G101","v":0},{"$f":"IF(I101=0,\"\",I101/H101)","v":""},0]
["Capital Spares",null,null,null,null,null,null,null,0,""]
["Heritage assets",null,{"$f":"SUM(C104:C108)","v":0},0,0,0,0,0,0,"",{"$f":"SUM(K104:K108)","v":0}]
["Monuments",null,null,null,null,null,null,null,0,""]
["Historic Buildings",null,null,null,null,null,null,null,0,""]
["Works of Art",null,null,null,null,null,null,null,0,""]
["Conservation Areas",null,null,null,null,null,null,null,0,""]
["Other Heritage",null,null,null,null,null,null,null,0,""]
[null,null,null,null,null,null,null,null,0,""]
["Investment properties",null,{"$f":"+C111+C114","v":0},0,0,0,0,0,0,"",{"$f":"+K111+K114","v":0}]
["Revenue Generating",null,{"$f":"SUM(C112:C113)","v":0},0,0,0,0,0,0,"",{"$f":"SUM(K112:K113)","v":0}]
["Improved Property",null,null,null,null,null,null,null,0,""]
["Unimproved Property",null,null,null,null,null,null,null,0,""]
["Non-revenue Generating",null,{"$f":"SUM(C115:C116)","v":0},0,0,0,0,0,0,"",{"$f":"SUM(K115:K116)","v":0}]
["Improved Property",null,null,null,null,null,null,null,0,""]
["Unimproved Property",null,null,null,null,null,null,null,{"$f":"H116-G116","v":0},{"$f":"IF(I116=0,\"\",I116/H116)","v":""}]
["Other assets",null,{"$f":"+C118+C130","v":0},0,0,0,0,0,0,"",{"$f":"+K118+K130","v":0}]
["Operational Buildings",null,{"$f":"SUM(C119:C129)","v":0},0,0,0,0,0,0,"",{"$f":"SUM(K119:K129)","v":0}]
["Municipal Offices",null,0,0,0,0,0,0,0,"",0]
["Pay/Enquiry Points",null,null,null,null,null,null,null,0,""]
["Building Plan Offices",null,null,null,null,null,null,null,0,""]
["Workshops",null,null,null,null,null,null,null,0,""]
["Yards",null,null,null,null,null,null,null,0,""]
["Stores",null,null,null,null,null,null,null,0,""]
["Laboratories",null,null,null,null,null,null,null,0,""]
["Training Centres",null,null,null,null,null,null,null,0,""]
["Manufacturing Plant",null,null,null,null,null,null,null,0,""]
["Depots",null,null,null,null,null,null,null,0,""]
["Capital Spares",null,null,null,null,null,null,null,0,""]
["Housing",null,{"$f":"SUM(C131:C133)","v":0},0,0,0,0,0,0,"",{"$f":"SUM(K131:K133)","v":0}]
["Staff Housing",null,null,null,null,null,null,null,0,""]
["Social Housing",null,null,null,null,null,null,null,0,""]
["Capital Spares",null,null,null,null,null,null,null,0,""]
[null,null,null,null,null,null,null,null,null,""]
["Biological or Cultivated Assets",null,{"$f":"SUM(C136:C136)","v":0},0,0,0,0,0,{"$f":"H135-G135","v":0},"",{"$f":"SUM(K136)","v":0}]
["Biological or Cultivated Assets",null,null,null,null,null,null,null,{"$f":"H136-G136","v":0},""]
[null,null,null,null,null,null,null,null,null,{"$f":"IF(I137=0,\"\",I137/H137)","v":""}]
["Intangible Assets",null,{"$f":"SUM(C139:C140)","v":0},0,0,0,0,0,{"$f":"H138-G138","v":0},"",{"$f":"SUM(K139:K140)","v":0}]
["Servitudes",null,null,null,null,null,null,null,0,""]
["Licences and Rights",null,{"$f":"SUM(C141:C146)","v":0},0,0,0,0,0,0,"",{"$f":"SUM(K141:K146)","v":0}]
["Water Rights",null,null,null,null,null,null,null,0,""]
["Effluent Licenses",null,null,null,null,null,null,null,0,""]
["Solid Waste Licenses",null,null,null,null,null,null,null,0,""]
["Computer Software and Applications",null,0,0,0,0,0,0,0,"",0]
["Load Settlement Software Applications",null,null,null,null,null,null,null,0,""]
["Unspecified",null,null,null,null,null,null,null,0,""]
[]
["Computer Equipment",null,{"$f":"SUM(C149:C149)","v":0},0,0,0,0,0,{"$f":"H148-G148","v":0},{"$f":"IF(I148=0,\"\",I148/H148)","v":""},{"$f":"SUM(K149)","v":0}]
["Computer Equipment",null,0,0,0,0,0,0,{"$f":"H149-G149","v":0},{"$f":"IF(I149=0,\"\",I149/H149)","v":""},0]
[]
["Furniture and Office Equipment",null,{"$f":"SUM(C152:C152)","v":0},0,0,0,0,0,{"$f":"H151-G151","v":0},{"$f":"IF(I151=0,\"\",I151/H151)","v":""},{"$f":"SUM(K152)","v":0}]
["Furniture and Office Equipment",null,0,0,0,0,0,0,{"$f":"H152-G152","v":0},{"$f":"IF(I152=0,\"\",I152/H152)","v":""},0]
[null,null,null,null,null,null,null,null,null,{"$f":"IF(I153=0,\"\",I153/H153)","v":""}]
["Machinery and Equipment",null,{"$f":"SUM(C155:C155)","v":0},0,0,0,0,0,{"$f":"H154-G154","v":0},{"$f":"IF(I154=0,\"\",I154/H154)","v":""},{"$f":"SUM(K155)","v":0}]
["Machinery and Equipment",null,null,null,null,null,null,null,{"$f":"H155-G155","v":0},{"$f":"IF(I155=0,\"\",I155/H155)","v":""}]
[]
["Transport Assets",null,{"$f":"SUM(C158:C158)","v":0},0,0,0,0,0,{"$f":"H157-G157","v":0},{"$f":"IF(I157=0,\"\",I157/H157)","v":""},{"$f":"SUM(K158)","v":0}]
["Transport Assets",null,null,null,null,null,null,null,{"$f":"H158-G158","v":0},{"$f":"IF(I158=0,\"\",I158/H158)","v":""}]
[]
["Land",null,{"$f":"SUM(C161:C161)","v":0},0,0,0,0,0,{"$f":"H160-G160","v":0},{"$f":"IF(I160=0,\"\",I160/H160)","v":""},{"$f":"SUM(K161)","v":0}]
["Land",null,null,null,null,null,null,null,{"$f":"H161-G161","v":0},{"$f":"IF(I161=0,\"\",I161/H161)","v":""}]
[null,null,null,null,null,null,null,null,null,"."]
["Zoo's, Marine and Non-biological Animals",null,{"$f":"SUM(C164:C164)","v":0},0,0,0,0,0,{"$f":"H163-G163","v":0},{"$f":"IF(I163=0,\"\",I163/H163)","v":""},{"$f":"SUM(K164)","v":0}]
["Zoo's, Marine and Non-biological Animals",null,null,null,null,null,null,null,{"$f":"H164-G164","v":0},{"$f":"IF(I164=0,\"\",I164/H164)","v":""}]
[]
["Living resources",null,{"$f":"+C167+C170","v":0},0,0,0,0,0,{"$f":"H166-G166","v":0},{"$f":"IF(I166=0,\"\",I166/H166)","v":""},{"$f":"+K167+K170","v":0}]
["Mature",null,{"$f":"+C168+C169","v":0},0,0,0,0,0,0,"",{"$f":"+K168+K169","v":0}]
["Policing and Protection",null,null,null,null,null,null,null,0,""]
["Zoological plants and animals",null,null,null,null,null,null,null,0,""]
["Immature",null,{"$f":"+C171+C172","v":0},0,0,0,0,0,0,"",{"$f":"+K171+K172","v":0}]
["Policing and Protection",null,null,null,null,null,null,null,0,""]
["Zoological plants and animals",null,null,null,null,null,null,null,0,""]
["Total Capital Expenditure on renewal of existing assets",1,{"$f":"C7+C75+C103+C110+C117+C135+C138+C148+C151+C154+C157+C160+C163+C166","v":0},0,0,0,0,0,{"$f":"H173-G173","v":0},{"$f":"IF(I173=0,\"\",I173/H173)","v":""},{"$f":"K7+K75+K103+K110+K117+K135+K138+K148+K151+K154+K157+K160+K163+K166","v":0}]
[]
[{"$f":"head27a","v":"References"}]
["1. Total Capital Expenditure on new assets (SC13a) plus Total Capital Expenditure on renewal of existing assets (SC13b) plus Total Capital Expenditure on upgrading of existing assets (SC13e) must reconcile to total capital expenditure in Table C5"]
[]
["check balance",null,{"$f":"C173+SC13a!C173+SC13e!C173-'C5-Capex'!C40","v":0},{"$f":"D173+SC13a!D173+SC13e!D173-'C5-Capex'!D40","v":0},{"$f":"E173+SC13a!E173+SC13e!E173-'C5-Capex'!E40","v":0},{"$f":"F173+SC13a!F173+SC13e!F173-'C5-Capex'!F40","v":0},{"$f":"G173+SC13a!G173+SC13e!G173-'C5-Capex'!G40","v":0},{"$f":"H173+SC13a!H173+SC13e!H173-'C5-Capex'!H40","v":0},null,null,{"$f":"K173+SC13a!K173+SC13e!K173-'C5-Capex'!K40","v":0}]

{"sheet":"SC13c","index":30,"n_rows":173,"n_cols":11,"rows_kept":173,"cut":false,"hidden":false,"merged":[[0,0,0,10],[1,0,2,0],[1,1,2,1]]}
[{"$f":"muni& \" - \"&S71Sc& \" - \"&Head57","v":"LIM353 Molemole - Supporting Table SC13c Monthly Budget Statement - expenditure on repairs and maintenance by asset class - Q3 Third Quarter"}]
[{"$f":"desc","v":"Description"},{"$f":"head27","v":"Ref"},{"$f":"Head1","v":"2024/25"},{"$f":"Head2","v":"Budget Year 2025/26"}]
[null,null,{"$f":"Head5","v":"Audited Outcome"},{"$f":"Head6","v":"Original Budget"},{"$f":"Head7","v":"Adjusted Budget"},{"$f":"Head38","v":"Monthly actual"},{"$f":"Head39","v":"YearTD actual"},{"$f":"Head40","v":"YearTD budget"},{"$f":"Head41","v":"YTD variance"},{"$f":"Head41","v":"YTD variance"},{"$f":"Head8","v":"Full Year Forecast"}]
["R thousands",1,null,null,null,null,null,null,null,"%"]
["Repairs and maintenance expenditure by Asset Class/Sub-class"]
[]
["Infrastructure",null,{"$f":"C8+C13+C17+C27+C38+C45+C53+C63+C69","v":5036592.96},4468400,4308400,303616,1312194.47,3296312,{"$f":"H7-G7","v":1984117.53},{"$f":"IF(I7=0,\"\",I7/H7)","v":0.60192042804200574},{"$f":"K8+K13+K17+K27+K38+K45+K53+K63+K69","v":4308400}]
["Roads Infrastructure",null,{"$f":"SUM(C9:C12)","v":5036592.96},4468400,4308400,303616,1312194.47,3296312,1984117.53,0.60192042804200574,{"$f":"SUM(K9:K12)","v":4308400}]
["Roads",null,2944234,2254000,2254000,28990,237769,1690506,1452737,0.85935039568034655,2254000]
["Road Structures",null,2092358.96,2214400,2054400,274626,1074425.47,1605806,531380.53,0.33091203420587545,2054400]
["Road Furniture",null,null,null,null,null,null,null,0,""]
["Capital Spares",null,null,null,null,null,null,null,0,""]
["Storm water Infrastructure",null,{"$f":"SUM(C14:C16)","v":0},0,0,0,0,0,0,"",{"$f":"SUM(K14:K16)","v":0}]
["Drainage Collection",null,null,null,null,null,null,null,0,""]
["Storm water Conveyance",null,null,null,null,null,null,null,0,""]
["Attenuation",null,null,null,null,null,null,null,0,""]
["Electrical Infrastructure",null,{"$f":"SUM(C18:C26)","v":0},0,0,0,0,0,0,"",{"$f":"SUM(K18:K26)","v":0}]
["Power Plants",null,null,null,null,null,null,null,0,""]
["HV Substations",null,null,null,null,null,null,null,0,""]
["HV Switching Station",null,null,null,null,null,null,null,0,""]
["HV Transmission Conductors",null,null,null,null,null,null,null,0,""]
["MV Substations",null,null,null,null,null,null,null,0,""]
["MV Switching Stations",null,null,null,null,null,null,null,0,""]
["MV Networks",null,0,0,0,0,0,0,0,"",0]
["LV Networks",null,null,null,null,null,null,null,0,""]
["Capital Spares",null,null,null,null,null,null,null,0,""]
["Water Supply Infrastructure",null,{"$f":"SUM(C28:C37)","v":0},0,0,0,0,0,0,"",{"$f":"SUM(K28:K37)","v":0}]
["Dams and Weirs",null,null,null,null,null,null,null,0,""]
["Boreholes",null,null,null,null,null,null,null,0,""]
["Reservoirs",null,null,null,null,null,null,null,0,""]
["Pump Stations",null,null,null,null,null,null,null,0,""]
["Water Treatment Works",null,null,null,null,null,null,null,0,""]
["Bulk Mains",null,null,null,null,null,null,null,0,""]
["Distribution",null,null,null,null,null,null,null,0,""]
["Distribution Points",null,null,null,null,null,null,null,0,""]
["PRV Stations",null,null,null,null,null,null,null,0,""]
["Capital Spares",null,null,null,null,null,null,null,0,""]
["Sanitation Infrastructure",null,{"$f":"SUM(C39:C44)","v":0},0,0,0,0,0,0,"",{"$f":"SUM(K39:K44)","v":0}]
["Pump Station",null,null,null,null,null,null,null,0,""]
["Reticulation",null,null,null,null,null,null,null,0,""]
["Waste Water Treatment Works",null,null,null,null,null,null,null,0,""]
["Outfall Sewers",null,null,null,null,null,null,null,0,""]
["Toilet Facilities",null,null,null,null,null,null,null,0,""]
["Capital Spares",null,null,null,null,null,null,null,0,""]
["Solid Waste Infrastructure",null,{"$f":"SUM(C46:C52)","v":0},0,0,0,0,0,0,"",{"$f":"SUM(K46:K52)","v":0}]
["Landfill Sites",null,null,null,null,null,null,null,0,""]
["Waste Transfer Stations",null,null,null,null,null,null,null,0,""]
["Waste Processing Facilities",null,null,null,null,null,null,null,0,""]
["Waste Drop-off Points",null,null,null,null,null,null,null,0,""]
["Waste Separation Facilities",null,null,null,null,null,null,null,0,""]
["Electricity Generation Facilities",null,null,null,null,null,null,null,0,""]
["Capital Spares",null,null,null,null,null,null,null,0,""]
["Rail Infrastructure",null,{"$f":"SUM(C54:C62)","v":0},0,0,0,0,0,0,"",{"$f":"SUM(K54:K62)","v":0}]
["Rail Lines",null,null,null,null,null,null,null,0,""]
["Rail Structures",null,null,null,null,null,null,null,0,""]
["Rail Furniture",null,null,null,null,null,null,null,0,""]
["Drainage Collection",null,null,null,null,null,null,null,0,""]
["Storm water Conveyance",null,null,null,null,null,null,null,0,""]
["Attenuation",null,null,null,null,null,null,null,0,""]
["MV Substations",null,null,null,null,null,null,null,0,""]
["LV Networks",null,null,null,null,null,null,null,0,""]
["Capital Spares",null,null,null,null,null,null,null,0,""]
["Coastal Infrastructure",null,{"$f":"SUM(C64:C68)","v":0},0,0,0,0,0,0,"",{"$f":"SUM(K64:K68)","v":0}]
["Sand Pumps",null,null,null,null,null,null,null,0,""]
["Piers",null,null,null,null,null,null,null,0,""]
["Revetments",null,null,null,null,null,null,null,0,""]
["Promenades",null,null,null,null,null,null,null,0,""]
["Capital Spares",null,null,null,null,null,null,null,0,""]
["Information and Communication Infrastructure",null,{"$f":"SUM(C70:C73)","v":0},0,0,0,0,0,0,"",{"$f":"SUM(K70:K73)","v":0}]
["Data Centres",null,null,null,null,null,null,null,0,""]
["Core Layers",null,null,null,null,null,null,null,0,""]
["Distribution Layers",null,null,null,null,null,null,null,0,""]
["Capital Spares",null,null,null,null,null,null,null,0,""]
[null,null,null,null,null,null,null,null,null,""]
["Community Assets",null,{"$f":"+C76+C99","v":203887},208800,208800,0,59450,156600,97150,0.62037037037037035,{"$f":"+K76+K99","v":208800}]
["Community Facilities",null,{"$f":"SUM(C77:C98)","v":143987},208800,208800,0,59450,156600,97150,0.62037037037037035,{"$f":"SUM(K77:K98)","v":208800}]
["Halls",null,0,208800,208800,0,59450,156600,97150,0.62037037037037035,208800]
["Centres",null,null,null,null,null,null,null,0,""]
["Crèches",null,null,null,null,null,null,null,0,""]
["Clinics/Care Centres",null,null,null,null,null,null,null,0,""]
["Fire/Ambulance Stations",null,null,null,null,null,null,null,0,""]
["Testing Stations",null,null,null,null,null,null,null,0,""]
["Museums",null,null,null,null,null,null,null,0,""]
["Galleries",null,null,null,null,null,null,null,0,""]
["Theatres",null,null,null,null,null,null,null,0,""]
["Libraries",null,null,null,null,null,null,null,0,""]
["Cemeteries/Crematoria",null,143987,0,0,0,0,0,0,"",0]
["Police",null,null,null,null,null,null,null,0,""]
["Purls",null,null,null,null,null,null,null,0,""]
["Public Open Space",null,null,null,null,null,null,null,0,""]
["Nature Reserves",null,null,null,null,null,null,null,0,""]
["Public Ablution Facilities",null,null,null,null,null,null,null,0,""]
["Markets",null,null,null,null,null,null,null,0,""]
["Stalls",null,null,null,null,null,null,null,0,""]
["Abattoirs",null,null,null,null,null,null,null,0,""]
["Airports",null,null,null,null,null,null,null,0,""]
["Taxi Ranks/Bus Terminals",null,null,null,null,null,null,null,0,""]
["Capital Spares",null,null,null,null,null,null,null,0,""]
["Sport and Recreation Facilities",null,{"$f":"SUM(C100:C102)","v":59900},0,0,0,0,0,0,"",{"$f":"SUM(K100:K102)","v":0}]
["Indoor Facilities",null,0,0,0,0,0,0,0,"",0]
["Outdoor Facilities",null,59900,0,0,0,0,0,{"$f":"H101-G101","v":0},{"$f":"IF(I101=0,\"\",I101/H101)","v":""},0]
["Capital Spares",null,null,null,null,null,null,null,0,""]
["Heritage assets",null,{"$f":"SUM(C104:C108)","v":0},0,0,0,0,0,0,"",{"$f":"SUM(K104:K108)","v":0}]
["Monuments",null,null,null,null,null,null,null,0,""]
["Historic Buildings",null,null,null,null,null,null,null,0,""]
["Works of Art",null,null,null,null,null,null,null,0,""]
["Conservation Areas",null,null,null,null,null,null,null,0,""]
["Other Heritage",null,null,null,null,null,null,null,0,""]
[null,null,null,null,null,null,null,null,0,""]
["Investment properties",null,{"$f":"+C111+C114","v":0},0,0,0,0,0,0,"",{"$f":"+K111+K114","v":0}]
["Revenue Generating",null,{"$f":"SUM(C112:C113)","v":0},0,0,0,0,0,0,"",{"$f":"SUM(K112:K113)","v":0}]
["Improved Property",null,null,null,null,null,null,null,0,""]
["Unimproved Property",null,null,null,null,null,null,null,0,""]
["Non-revenue Generating",null,{"$f":"SUM(C115:C116)","v":0},0,0,0,0,0,0,"",{"$f":"SUM(K115:K116)","v":0}]
["Improved Property",null,null,null,null,null,null,null,0,""]
["Unimproved Property",null,null,null,null,null,null,null,{"$f":"H116-G116","v":0},{"$f":"IF(I116=0,\"\",I116/H116)","v":""}]
["Other assets",null,{"$f":"+C118+C130","v":1141997.56},978600,1038600,0,408835,748950,340115,0.45412243807997865,{"$f":"+K118+K130","v":1038600}]
["Operational Buildings",null,{"$f":"SUM(C119:C129)","v":1141997.56},978600,1038600,0,408835,748950,340115,0.45412243807997865,{"$f":"SUM(K119:K129)","v":1038600}]
["Municipal Offices",null,1141997.56,978600,1038600,0,408835,748950,340115,0.45412243807997865,1038600]
["Pay/Enquiry Points",null,null,null,null,null,null,null,0,""]
["Building Plan Offices",null,null,null,null,null,null,null,0,""]
["Workshops",null,null,null,null,null,null,null,0,""]
["Yards",null,null,null,null,null,null,null,0,""]
["Stores",null,null,null,null,null,null,null,0,""]
["Laboratories",null,null,null,null,null,null,null,0,""]
["Training Centres",null,null,null,null,null,null,null,0,""]
["Manufacturing Plant",null,null,null,null,null,null,null,0,""]
["Depots",null,null,null,null,null,null,null,0,""]
["Capital Spares",null,null,null,null,null,null,null,0,""]
["Housing",null,{"$f":"SUM(C131:C133)","v":0},0,0,0,0,0,0,"",{"$f":"SUM(K131:K133)","v":0}]
["Staff Housing",null,null,null,null,null,null,null,0,""]
["Social Housing",null,null,null,null,null,null,null,0,""]
["Capital Spares",null,null,null,null,null,null,null,0,""]
[null,null,null,null,null,null,null,null,null,""]
["Biological or Cultivated Assets",null,{"$f":"SUM(C136:C136)","v":0},0,0,0,0,0,{"$f":"H135-G135","v":0},"",{"$f":"SUM(K136)","v":0}]
["Biological or Cultivated Assets",null,null,null,null,null,null,null,{"$f":"H136-G136","v":0},""]
[null,null,null,null,null,null,null,null,null,""]
["Intangible Assets",null,{"$f":"SUM(C139:C140)","v":0},0,0,0,0,0,{"$f":"H138-G138","v":0},"",{"$f":"SUM(K139:K140)","v":0}]
["Servitudes",null,null,null,null,null,null,null,0,""]
["Licences and Rights",null,{"$f":"SUM(C141:C146)","v":0},0,0,0,0,0,0,"",{"$f":"SUM(K141:K146)","v":0}]
["Water Rights",null,null,null,null,null,null,null,0,""]
["Effluent Licenses",null,null,null,null,null,null,null,0,""]
["Solid Waste Licenses",null,null,null,null,null,null,null,0,""]
["Computer Software and Applications",null,null,null,null,null,null,null,0,""]
["Load Settlement Software Applications",null,null,null,null,null,null,null,0,""]
["Unspecified",null,null,null,null,null,null,null,0,""]
[]
["Computer Equipment",null,{"$f":"SUM(C149:C149)","v":2889451.52},3508400,3608400,563787.78,1910836.64,2671303,{"$f":"H148-G148","v":760466.3600000001},{"$f":"IF(I148=0,\"\",I148/H148)","v":0.28467993335087788},{"$f":"SUM(K149)","v":3608400}]
["Computer Equipment",null,2889451.52,3508400,3608400,563787.78,1910836.64,2671303,{"$f":"H149-G149","v":760466.3600000001},{"$f":"IF(I149=0,\"\",I149/H149)","v":0.28467993335087788},3608400]
[]
["Furniture and Office Equipment",null,{"$f":"SUM(C152:C152)","v":258056.2},208800,208800,0,192070.18,156600,{"$f":"H151-G151","v":-35470.179999999993},{"$f":"IF(I151=0,\"\",I151/H151)","v":-0.2265017879948914},{"$f":"SUM(K152)","v":208800}]
["Furniture and Office Equipment",null,258056.2,208800,208800,0,192070.18,156600,{"$f":"H152-G152","v":-35470.179999999993},{"$f":"IF(I152=0,\"\",I152/H152)","v":-0.2265017879948914},208800]
[null,null,null,null,null,null,null,null,null,{"$f":"IF(I153=0,\"\",I153/H153)","v":""}]
["Machinery and Equipment",null,{"$f":"SUM(C155:C155)","v":3922872.23},3837000,4577000,195750.43,3421035.43,3173759,{"$f":"H154-G154","v":-247276.43000000017},{"$f":"IF(I154=0,\"\",I154/H154)","v":-7.7912793630518312E-2},{"$f":"SUM(K155)","v":4577000}]
["Machinery and Equipment",null,3922872.23,3837000,4577000,195750.43,3421035.43,3173759,{"$f":"H155-G155","v":-247276.43000000017},{"$f":"IF(I155=0,\"\",I155/H155)","v":-7.7912793630518312E-2},4577000]
[]
["Transport Assets",null,{"$f":"SUM(C158:C158)","v":997427.68},0,0,0,0,0,{"$f":"H157-G157","v":0},{"$f":"IF(I157=0,\"\",I157/H157)","v":""},{"$f":"SUM(K158)","v":0}]
["Transport Assets",null,997427.68,0,0,0,0,0,{"$f":"H158-G158","v":0},{"$f":"IF(I158=0,\"\",I158/H158)","v":""},0]
[]
["Land",null,{"$f":"SUM(C161:C161)","v":0},0,0,0,0,0,{"$f":"H160-G160","v":0},{"$f":"IF(I160=0,\"\",I160/H160)","v":""},{"$f":"SUM(K161)","v":0}]
["Land",null,null,null,null,null,null,null,{"$f":"H161-G161","v":0},{"$f":"IF(I161=0,\"\",I161/H161)","v":""}]
[]
["Zoo's, Marine and Non-biological Animals",null,{"$f":"SUM(C164:C164)","v":0},0,0,0,0,0,{"$f":"H163-G163","v":0},{"$f":"IF(I163=0,\"\",I163/H163)","v":""},{"$f":"SUM(K164)","v":0}]
["Zoo's, Marine and Non-biological Animals",null,null,null,null,null,null,null,{"$f":"H164-G164","v":0},{"$f":"IF(I164=0,\"\",I164/H164)","v":""}]
[]
["Living resources",null,{"$f":"+C167+C170","v":0},0,0,0,0,0,{"$f":"H166-G166","v":0},{"$f":"IF(I166=0,\"\",I166/H166)","v":""},{"$f":"+K167+K170","v":0}]
["Mature",null,{"$f":"+C168+C169","v":0},0,0,0,0,0,0,"",{"$f":"+K168+K169","v":0}]
["Policing and Protection",null,null,null,null,null,null,null,0,""]
["Zoological plants and animals",null,null,null,null,null,null,null,0,""]
["Immature",null,{"$f":"+C171+C172","v":0},0,0,0,0,0,0,"",{"$f":"+K171+K172","v":0}]
["Policing and Protection",null,null,null,null,null,null,null,0,""]
["Zoological plants and animals",null,null,null,null,null,null,null,0,""]
["Total Repairs and Maintenance Expenditure",1,{"$f":"C7+C75+C103+C110+C117+C135+C138+C148+C151+C154+C157+C160+C163+C166","v":14450285.149999999},13210000,13950000,1063154.21,7304421.7200000007,10203524,{"$f":"H173-G173","v":2899102.2799999993},{"$f":"IF(I173=0,\"\",I173/H173)","v":0.28412755044237653},{"$f":"K7+K75+K103+K110+K117+K135+K138+K148+K151+K154+K157+K160+K163+K166","v":13950000}]

{"sheet":"SC13d","index":31,"n_rows":173,"n_cols":11,"rows_kept":173,"cut":false,"hidden":false,"merged":[[0,0,0,10],[1,0,2,0],[1,1,2,1]]}
[{"$f":"muni& \" - \"&S71Sd& \" - \"&Head57","v":"LIM353 Molemole - Supporting Table SC13d Monthly Budget Statement - depreciation by asset class - Q3 Third Quarter"}]
[{"$f":"desc","v":"Description"},{"$f":"head27","v":"Ref"},{"$f":"Head1","v":"2024/25"},{"$f":"Head2","v":"Budget Year 2025/26"}]
[null,null,{"$f":"Head5","v":"Audited Outcome"},{"$f":"Head6","v":"Original Budget"},{"$f":"Head7","v":"Adjusted Budget"},{"$f":"Head38","v":"Monthly actual"},{"$f":"Head39","v":"YearTD actual"},{"$f":"Head40","v":"YearTD budget"},{"$f":"Head41","v":"YTD variance"},{"$f":"Head41","v":"YTD variance"},{"$f":"Head8","v":"Full Year Forecast"}]
["R thousands",1,null,null,null,null,null,null,null,"%"]
["Depreciation by Asset Class/Sub-class"]
[]
["Infrastructure",null,{"$f":"C8+C13+C17+C27+C38+C45+C53+C63+C69","v":16334420.75},9573765,9573765,0,7086871.5399999991,7180353,{"$f":"H7-G7","v":93481.460000000894},{"$f":"IF(I7=0,\"\",I7/H7)","v":1.3019061876205933E-2},{"$f":"K8+K13+K17+K27+K38+K45+K53+K63+K69","v":9573765}]
["Roads Infrastructure",null,{"$f":"SUM(C9:C12)","v":12559560.83},8573673,8573673,0,6420851.3899999997,6430266,9414.6100000003353,1.4641089497697817E-3,{"$f":"SUM(K9:K12)","v":8573673}]
["Roads",null,12345248.609999999,8380334,8380334,0,6313106.79,6285258,-27848.790000000037,-4.4308109547770416E-3,8380334]
["Road Structures",null,0,0,0,0,0,0,0,"",0]
["Road Furniture",null,214312.22,193339,193339,0,107744.6,145008,37263.399999999994,0.25697478759792558,193339]
["Capital Spares",null,0,0,0,0,0,0,0,"",0]
["Storm water Infrastructure",null,{"$f":"SUM(C14:C16)","v":0},0,0,0,0,0,0,"",{"$f":"SUM(K14:K16)","v":0}]
["Drainage Collection",null,0,0,0,0,0,0,0,"",0]
["Storm water Conveyance",null,0,0,0,0,0,0,0,"",0]
["Attenuation",null,0,0,0,0,0,0,0,"",0]
["Electrical Infrastructure",null,{"$f":"SUM(C18:C26)","v":1333393.22},1000092,1000092,0,666020.14999999991,750087,84066.850000000093,0.11207613250196323,{"$f":"SUM(K18:K26)","v":1000092}]
["Power Plants",null,77146.14,0,0,0,0,0,0,"",0]
["HV Substations",null,0,0,0,0,0,0,0,"",0]
["HV Switching Station",null,0,0,0,0,0,0,0,"",0]
["HV Transmission Conductors",null,0,0,0,0,0,0,0,"",0]
["MV Substations",null,0,0,0,0,0,0,0,"",0]
["MV Switching Stations",null,0,0,0,0,0,0,0,"",0]
["MV Networks",null,300076.28999999998,160827,160827,0,201317.49,120627,-80690.489999999991,-0.66892561366858161,160827]
["LV Networks",null,956170.79,839265,839265,0,464702.66,629460,164757.34000000003,0.2617439392495155,839265]
["Capital Spares",null,0,0,0,0,0,0,0,"",0]
["Water Supply Infrastructure",null,{"$f":"SUM(C28:C37)","v":0},0,0,0,0,0,0,"",{"$f":"SUM(K28:K37)","v":0}]
["Dams and Weirs",null,0,0,0,0,0,0,0,"",0]
["Boreholes",null,0,0,0,0,0,0,0,"",0]
["Reservoirs",null,0,0,0,0,0,0,0,"",0]
["Pump Stations",null,0,0,0,0,0,0,0,"",0]
["Water Treatment Works",null,0,0,0,0,0,0,0,"",0]
["Bulk Mains",null,0,0,0,0,0,0,0,"",0]
["Distribution",null,0,0,0,0,0,0,0,"",0]
["Distribution Points",null,0,0,0,0,0,0,0,"",0]
["PRV Stations",null,0,0,0,0,0,0,0,"",0]
["Capital Spares",null,0,0,0,0,0,0,0,"",0]
["Sanitation Infrastructure",null,{"$f":"SUM(C39:C44)","v":0},0,0,0,0,0,0,"",{"$f":"SUM(K39:K44)","v":0}]
["Pump Station",null,0,0,0,0,0,0,0,"",0]
["Reticulation",null,0,0,0,0,0,0,0,"",0]
["Waste Water Treatment Works",null,0,0,0,0,0,0,0,"",0]
["Outfall Sewers",null,0,0,0,0,0,0,0,"",0]
["Toilet Facilities",null,0,0,0,0,0,0,0,"",0]
["Capital Spares",null,0,0,0,0,0,0,0,"",0]
["Solid Waste Infrastructure",null,{"$f":"SUM(C46:C52)","v":2441466.7000000002},0,0,0,0,0,0,"",{"$f":"SUM(K46:K52)","v":0}]
["Landfill Sites",null,2441466.7000000002,0,0,0,0,0,0,"",0]
["Waste Transfer Stations",null,0,0,0,0,0,0,0,"",0]
["Waste Processing Facilities",null,0,0,0,0,0,0,0,"",0]
["Waste Drop-off Points",null,0,0,0,0,0,0,0,"",0]
["Waste Separation Facilities",null,0,0,0,0,0,0,0,"",0]
["Electricity Generation Facilities",null,0,0,0,0,0,0,0,"",0]
["Capital Spares",null,0,0,0,0,0,0,0,"",0]
["Rail Infrastructure",null,{"$f":"SUM(C54:C62)","v":0},0,0,0,0,0,0,"",{"$f":"SUM(K54:K62)","v":0}]
["Rail Lines",null,0,0,0,0,0,0,0,"",0]
["Rail Structures",null,0,0,0,0,0,0,0,"",0]
["Rail Furniture",null,0,0,0,0,0,0,0,"",0]
["Drainage Collection",null,0,0,0,0,0,0,0,"",0]
["Storm water Conveyance",null,0,0,0,0,0,0,0,"",0]
["Attenuation",null,0,0,0,0,0,0,0,"",0]
["MV Substations",null,0,0,0,0,0,0,0,"",0]
["LV Networks",null,0,0,0,0,0,0,0,"",0]
["Capital Spares",null,0,0,0,0,0,0,0,"",0]
["Coastal Infrastructure",null,{"$f":"SUM(C64:C68)","v":0},0,0,0,0,0,0,"",{"$f":"SUM(K64:K68)","v":0}]
["Sand Pumps",null,0,0,0,0,0,0,0,"",0]
["Piers",null,0,0,0,0,0,0,0,"",0]
["Revetments",null,0,0,0,0,0,0,0,"",0]
["Promenades",null,0,0,0,0,0,0,0,"",0]
["Capital Spares",null,0,0,0,0,0,0,0,"",0]
["Information and Communication Infrastructure",null,{"$f":"SUM(C70:C73)","v":0},0,0,0,0,0,0,"",{"$f":"SUM(K70:K73)","v":0}]
["Data Centres",null,null,null,null,null,null,null,0,""]
["Core Layers",null,null,null,null,null,null,null,0,""]
["Distribution Layers",null,null,null,null,null,null,null,0,""]
["Capital Spares",null,null,null,null,null,null,null,0,""]
[null,null,null,null,null,null,null,null,null,""]
["Community Assets",null,{"$f":"+C76+C99","v":2619819.3199999998},2687178,2687178,0,1236959.0300000003,2015433,778473.96999999974,0.38625643720232811,{"$f":"+K76+K99","v":2687178}]
["Community Facilities",null,{"$f":"SUM(C77:C98)","v":2619819.3199999998},1159843,1159843,0,1236959.0300000003,869922,-367037.03000000026,-0.42191947094107318,{"$f":"SUM(K77:K98)","v":1159843}]
["Halls",null,144557.57,199243,199243,0,72872.84,149436,76563.16,0.51234749324125384,199243]
["Centres",null,2171404.98,588466,588466,0,276007.82,441360,165352.18,0.37464242341852455,588466]
["Crèches",null,0,0,0,0,0,0,0,"",0]
["Clinics/Care Centres",null,0,0,0,0,0,0,0,"",0]
["Fire/Ambulance Stations",null,0,0,0,0,0,0,0,"",0]
["Testing Stations",null,0,0,0,0,0,0,0,"",0]
["Museums",null,0,0,0,0,0,0,0,"",0]
["Galleries",null,0,0,0,0,0,0,0,"",0]
["Theatres",null,0,0,0,0,0,0,0,"",0]
["Libraries",null,0,0,0,0,0,0,0,"",0]
["Cemeteries/Crematoria",null,0,0,0,0,0,0,0,"",0]
["Police",null,0,0,0,0,0,0,0,"",0]
["Purls",null,0,0,0,0,0,0,0,"",0]
["Public Open Space",null,4483.75,0,0,0,742825.31,0,-742825.31,{"$error":"#DIV/0!"},0]
["Nature Reserves",null,0,0,0,0,0,0,0,"",0]
["Public Ablution Facilities",null,20833.650000000001,10550,10550,0,12423,7920,-4503,-0.5685606060606061,10550]
["Markets",null,30762.27,19904,19904,0,15507.55,14931,-576.54999999999927,-3.8614292411760717E-2,19904]
["Stalls",null,0,0,0,0,0,0,0,"",0]
["Abattoirs",null,0,0,0,0,0,0,0,"",0]
["Airports",null,0,0,0,0,0,0,0,"",0]
["Taxi Ranks/Bus Terminals",null,247777.1,341680,341680,0,117322.51,256275,138952.49,0.54220072188079205,341680]
["Capital Spares",null,0,0,0,0,0,0,0,"",0]
["Sport and Recreation Facilities",null,{"$f":"SUM(C100:C102)","v":0},1527335,1527335,0,0,1145511,1145511,1,{"$f":"SUM(K100:K102)","v":1527335}]
["Indoor Facilities",null,null,null,null,null,null,null,0,""]
["Outdoor Facilities",null,0,1527335,1527335,0,0,1145511,{"$f":"H101-G101","v":1145511},{"$f":"IF(I101=0,\"\",I101/H101)","v":1},1527335]
["Capital Spares",null,null,null,null,null,null,null,0,""]
["Heritage assets",null,{"$f":"SUM(C104:C108)","v":0},0,0,0,12467093.050000001,0,-12467093.050000001,{"$error":"#DIV/0!"},{"$f":"SUM(K104:K108)","v":0}]
["Monuments",null,null,null,null,null,null,null,0,""]
["Historic Buildings",null,null,null,null,null,null,null,0,""]
["Works of Art",null,null,null,null,null,null,null,0,""]
["Conservation Areas",null,null,null,null,null,null,null,0,""]
["Other Heritage",null,0,0,0,0,12467093.050000001,0,-12467093.050000001,{"$error":"#DIV/0!"},0]
[null,null,null,null,null,null,null,null,0,""]
["Investment properties",null,{"$f":"+C111+C114","v":43303.67},0,0,0,21829.8,0,-21829.8,{"$error":"#DIV/0!"},{"$f":"+K111+K114","v":0}]
["Revenue Generating",null,{"$f":"SUM(C112:C113)","v":43303.67},0,0,0,21829.8,0,-21829.8,{"$error":"#DIV/0!"},{"$f":"SUM(K112:K113)","v":0}]
["Improved Property",null,43303.67,0,0,0,21829.8,0,-21829.8,{"$error":"#DIV/0!"},0]
["Unimproved Property",null,0,0,0,0,0,0,0,"",0]
["Non-revenue Generating",null,{"$f":"SUM(C115:C116)","v":0},0,0,0,0,0,0,"",{"$f":"SUM(K115:K116)","v":0}]
["Improved Property",null,null,null,null,null,null,null,0,""]
["Unimproved Property",null,0,0,0,0,0,0,{"$f":"H116-G116","v":0},{"$f":"IF(I116=0,\"\",I116/H116)","v":""},0]
["Other assets",null,{"$f":"+C118+C130","v":1615511.28},1471680,1471680,0,807053.43,1103769,296715.56999999995,0.26882035099735541,{"$f":"+K118+K130","v":1471680}]
["Operational Buildings",null,{"$f":"SUM(C119:C129)","v":1615511.28},1471680,1471680,0,807053.43,1103769,296715.56999999995,0.26882035099735541,{"$f":"SUM(K119:K129)","v":1471680}]
["Municipal Offices",null,1615511.28,1471680,1471680,0,807053.43,1103769,296715.56999999995,0.26882035099735541,1471680]
["Pay/Enquiry Points",null,0,0,0,0,0,0,0,"",0]
["Building Plan Offices",null,0,0,0,0,0,0,0,"",0]
["Workshops",null,0,0,0,0,0,0,0,"",0]
["Yards",null,0,0,0,0,0,0,0,"",0]
["Stores",null,0,0,0,0,0,0,0,"",0]
["Laboratories",null,0,0,0,0,0,0,0,"",0]
["Training Centres",null,0,0,0,0,0,0,0,"",0]
["Manufacturing Plant",null,0,0,0,0,0,0,0,"",0]
["Depots",null,0,0,0,0,0,0,0,"",0]
["Capital Spares",null,0,0,0,0,0,0,0,"",0]
["Housing",null,{"$f":"SUM(C131:C133)","v":0},0,0,0,0,0,0,"",{"$f":"SUM(K131:K133)","v":0}]
["Staff Housing",null,0,0,0,0,0,0,0,"",0]
["Social Housing",null,0,0,0,0,0,0,0,"",0]
["Capital Spares",null,0,0,0,0,0,0,0,"",0]
[null,null,null,null,null,null,null,null,null,""]
["Biological or Cultivated Assets",null,{"$f":"SUM(C136:C136)","v":0},0,0,0,0,0,{"$f":"H135-G135","v":0},"",{"$f":"SUM(K136)","v":0}]
["Biological or Cultivated Assets",null,null,null,null,null,null,null,{"$f":"H136-G136","v":0},""]
[null,null,null,null,null,null,null,null,null,""]
["Intangible Assets",null,{"$f":"SUM(C139:C140)","v":155130.5},840356,841324,0,55165.04,630684.19999999995,{"$f":"H138-G138","v":575519.15999999992},0.91253143807946979,{"$f":"SUM(K139:K140)","v":841324}]
["Servitudes",null,0,505727,505727,0,0,379296,379296,1,505727]
["Licences and Rights",null,{"$f":"SUM(C141:C146)","v":155130.5},334629,335597,0,55165.04,251388.2,196223.16,0.7805583555632285,{"$f":"SUM(K141:K146)","v":335597}]
["Water Rights",null,null,null,null,null,null,null,0,""]
["Effluent Licenses",null,null,null,null,null,null,null,0,""]
["Solid Waste Licenses",null,null,null,null,null,null,null,0,""]
["Computer Software and Applications",null,155130.5,334629,335597,0,55165.04,251388.2,196223.16,0.7805583555632285,335597]
["Load Settlement Software Applications",null,null,null,null,null,null,null,0,""]
["Unspecified",null,0,0,0,0,0,0,0,"",0]
[]
["Computer Equipment",null,{"$f":"SUM(C149:C149)","v":783900.57},969257,969257,0,400995.43,726993,{"$f":"H148-G148","v":325997.57},{"$f":"IF(I148=0,\"\",I148/H148)","v":0.44841913195862959},{"$f":"SUM(K149)","v":969257}]
["Computer Equipment",null,783900.57,969257,969257,0,400995.43,726993,{"$f":"H149-G149","v":325997.57},{"$f":"IF(I149=0,\"\",I149/H149)","v":0.44841913195862959},969257]
[]
["Furniture and Office Equipment",null,{"$f":"SUM(C152:C152)","v":463577.79},2252031,2252031,0,305883.40999999997,1689111,{"$f":"H151-G151","v":1383227.59},{"$f":"IF(I151=0,\"\",I151/H151)","v":0.81890863892307852},{"$f":"SUM(K152)","v":2252031}]
["Furniture and Office Equipment",null,463577.79,2252031,2252031,0,305883.40999999997,1689111,{"$f":"H152-G152","v":1383227.59},{"$f":"IF(I152=0,\"\",I152/H152)","v":0.81890863892307852},2252031]
[null,null,null,null,null,null,null,null,null,{"$f":"IF(I153=0,\"\",I153/H153)","v":""}]
["Machinery and Equipment",null,{"$f":"SUM(C155:C155)","v":673934.56},1674425,1674425,0,399873.14,1255860,{"$f":"H154-G154","v":855986.86},{"$f":"IF(I154=0,\"\",I154/H154)","v":0.68159417450989757},{"$f":"SUM(K155)","v":1674425}]
["Machinery and Equipment",null,673934.56,1674425,1674425,0,399873.14,1255860,{"$f":"H155-G155","v":855986.86},{"$f":"IF(I155=0,\"\",I155/H155)","v":0.68159417450989757},1674425]
[]
["Transport Assets",null,{"$f":"SUM(C158:C158)","v":1722046.38},2187564,4663535,0,927599.66,2631079.4,{"$f":"H157-G157","v":1703479.7399999998},{"$f":"IF(I157=0,\"\",I157/H157)","v":0.64744520442826614},{"$f":"SUM(K158)","v":4663535}]
["Transport Assets",null,1722046.38,2187564,4663535,0,927599.66,2631079.4,{"$f":"H158-G158","v":1703479.7399999998},{"$f":"IF(I158=0,\"\",I158/H158)","v":0.64744520442826614},4663535]
[]
["Land",null,{"$f":"SUM(C161:C161)","v":0},0,0,0,0,0,{"$f":"H160-G160","v":0},{"$f":"IF(I160=0,\"\",I160/H160)","v":""},{"$f":"SUM(K161)","v":0}]
["Land",null,0,0,0,0,0,0,{"$f":"H161-G161","v":0},{"$f":"IF(I161=0,\"\",I161/H161)","v":""},0]
[]
["Zoo's, Marine and Non-biological Animals",null,{"$f":"SUM(C164:C164)","v":0},0,0,0,0,0,{"$f":"H163-G163","v":0},{"$f":"IF(I163=0,\"\",I163/H163)","v":""},{"$f":"SUM(K164)","v":0}]
["Zoo's, Marine and Non-biological Animals",null,0,0,0,0,0,0,{"$f":"H164-G164","v":0},{"$f":"IF(I164=0,\"\",I164/H164)","v":""},0]
[null,null,null,null,null,null,null,null,null,{"$f":"IF(I165=0,\"\",I165/H165)","v":""}]
["Living resources",null,{"$f":"+C167+C170","v":0},0,0,0,0,0,{"$f":"H166-G166","v":0},"",{"$f":"+K167+K170","v":0}]
["Mature",null,{"$f":"+C168+C169","v":0},0,0,0,0,0,0,"",{"$f":"+K168+K169","v":0}]
["Policing and Protection",null,null,null,null,null,null,null,0,""]
["Zoological plants and animals",null,null,null,null,null,null,null,0,""]
["Immature",null,{"$f":"+C171+C172","v":0},0,0,0,0,0,0,"",{"$f":"+K171+K172","v":0}]
["Policing and Protection",null,null,null,null,null,null,null,0,""]
["Zoological plants and animals",null,null,null,null,null,null,null,0,""]
["Total Depreciation",1,{"$f":"C7+C75+C103+C110+C117+C135+C138+C148+C151+C154+C157+C160+C163+C166","v":24411644.82},21656256,24133195,0,23709323.530000001,17233282.599999998,{"$f":"H173-G173","v":-6476040.9300000034},{"$f":"IF(I173=0,\"\",I173/H173)","v":-0.37578684690054376},{"$f":"K7+K75+K103+K110+K117+K135+K138+K148+K151+K154+K157+K160+K163+K166","v":24133195}]

{"sheet":"SC13e","index":32,"n_rows":176,"n_cols":11,"rows_kept":176,"cut":false,"hidden":false,"merged":[[0,0,0,10],[1,0,2,0],[1,1,2,1]]}
[{"$f":"muni& \" - \"&S71Se& \" - \"&Head57","v":"LIM353 Molemole - Supporting Table SC13e Monthly Budget Statement - capital expenditure on upgrading of existing assets by asset class - Q3 Third Quarter"}]
[{"$f":"desc","v":"Description"},{"$f":"head27","v":"Ref"},{"$f":"Head1","v":"2024/25"},{"$f":"Head2","v":"Budget Year 2025/26"}]
[null,null,{"$f":"Head5","v":"Audited Outcome"},{"$f":"Head6","v":"Original Budget"},{"$f":"Head7","v":"Adjusted Budget"},{"$f":"Head38","v":"Monthly actual"},{"$f":"Head39","v":"YearTD actual"},{"$f":"Head40","v":"YearTD budget"},{"$f":"Head41","v":"YTD variance"},{"$f":"Head41","v":"YTD variance"},{"$f":"Head8","v":"Full Year Forecast"}]
["R thousands",1,null,null,null,null,null,null,null,"%"]
["Capital expenditure on upgrading of existing assets by Asset Class/Sub-class"]
[]
["Infrastructure",null,{"$f":"C8+C13+C17+C27+C38+C45+C53+C63+C69","v":1463370.5},0,0,0,0,0,{"$f":"H7-G7","v":0},{"$f":"IF(I7=0,\"\",I7/H7)","v":""},{"$f":"K8+K13+K17+K27+K38+K45+K53+K63+K69","v":0}]
["Roads Infrastructure",null,{"$f":"SUM(C9:C12)","v":0},0,0,0,0,0,0,"",{"$f":"SUM(K9:K12)","v":0}]
["Roads",null,null,null,null,null,null,null,0,""]
["Road Structures",null,null,null,null,null,null,null,0,""]
["Road Furniture",null,null,null,null,null,null,null,0,""]
["Capital Spares",null,null,null,null,null,null,null,0,""]
["Storm water Infrastructure",null,{"$f":"SUM(C14:C16)","v":0},0,0,0,0,0,0,"",{"$f":"SUM(K14:K16)","v":0}]
["Drainage Collection",null,null,null,null,null,null,null,0,""]
["Storm water Conveyance",null,null,null,null,null,null,null,0,""]
["Attenuation",null,null,null,null,null,null,null,0,""]
["Electrical Infrastructure",null,{"$f":"SUM(C18:C26)","v":0},0,0,0,0,0,0,"",{"$f":"SUM(K18:K26)","v":0}]
["Power Plants",null,null,null,null,null,null,null,0,""]
["HV Substations",null,null,null,null,null,null,null,0,""]
["HV Switching Station",null,null,null,null,null,null,null,0,""]
["HV Transmission Conductors",null,null,null,null,null,null,null,0,""]
["MV Substations",null,null,null,null,null,null,null,0,""]
["MV Switching Stations",null,null,null,null,null,null,null,0,""]
["MV Networks",null,null,null,null,null,null,null,0,""]
["LV Networks",null,null,null,null,null,null,null,0,""]
["Capital Spares",null,null,null,null,null,null,null,0,""]
["Water Supply Infrastructure",null,{"$f":"SUM(C28:C37)","v":0},0,0,0,0,0,0,"",{"$f":"SUM(K28:K37)","v":0}]
["Dams and Weirs",null,null,null,null,null,null,null,0,""]
["Boreholes",null,null,null,null,null,null,null,0,""]
["Reservoirs",null,null,null,null,null,null,null,0,""]
["Pump Stations",null,null,null,null,null,null,null,0,""]
["Water Treatment Works",null,null,null,null,null,null,null,0,""]
["Bulk Mains",null,null,null,null,null,null,null,0,""]
["Distribution",null,null,null,null,null,null,null,0,""]
["Distribution Points",null,null,null,null,null,null,null,0,""]
["PRV Stations",null,null,null,null,null,null,null,0,""]
["Capital Spares",null,null,null,null,null,null,null,0,""]
["Sanitation Infrastructure",null,{"$f":"SUM(C39:C44)","v":0},0,0,0,0,0,0,"",{"$f":"SUM(K39:K44)","v":0}]
["Pump Station",null,null,null,null,null,null,null,0,""]
["Reticulation",null,null,null,null,null,null,null,0,""]
["Waste Water Treatment Works",null,null,null,null,null,null,null,0,""]
["Outfall Sewers",null,null,null,null,null,null,null,0,""]
["Toilet Facilities",null,null,null,null,null,null,null,0,""]
["Capital Spares",null,null,null,null,null,null,null,0,""]
["Solid Waste Infrastructure",null,{"$f":"SUM(C46:C52)","v":1463370.5},0,0,0,0,0,0,"",{"$f":"SUM(K46:K52)","v":0}]
["Landfill Sites",null,1463370.5,0,0,0,0,0,0,"",0]
["Waste Transfer Stations",null,null,null,null,null,null,null,0,""]
["Waste Processing Facilities",null,null,null,null,null,null,null,0,""]
["Waste Drop-off Points",null,null,null,null,null,null,null,0,""]
["Waste Separation Facilities",null,null,null,null,null,null,null,0,""]
["Electricity Generation Facilities",null,null,null,null,null,null,null,0,""]
["Capital Spares",null,null,null,null,null,null,null,0,""]
["Rail Infrastructure",null,{"$f":"SUM(C54:C62)","v":0},0,0,0,0,0,0,"",{"$f":"SUM(K54:K62)","v":0}]
["Rail Lines",null,null,null,null,null,null,null,0,""]
["Rail Structures",null,null,null,null,null,null,null,0,""]
["Rail Furniture",null,null,null,null,null,null,null,0,""]
["Drainage Collection",null,null,null,null,null,null,null,0,""]
["Storm water Conveyance",null,null,null,null,null,null,null,0,""]
["Attenuation",null,null,null,null,null,null,null,0,""]
["MV Substations",null,null,null,null,null,null,null,0,""]
["LV Networks",null,null,null,null,null,null,null,0,""]
["Capital Spares",null,null,null,null,null,null,null,0,""]
["Coastal Infrastructure",null,{"$f":"SUM(C64:C68)","v":0},0,0,0,0,0,0,"",{"$f":"SUM(K64:K68)","v":0}]
["Sand Pumps",null,null,null,null,null,null,null,0,""]
["Piers",null,null,null,null,null,null,null,0,""]
["Revetments",null,null,null,null,null,null,null,0,""]
["Promenades",null,null,null,null,null,null,null,0,""]
["Capital Spares",null,null,null,null,null,null,null,0,""]
["Information and Communication Infrastructure",null,{"$f":"SUM(C70:C73)","v":0},0,0,0,0,0,0,"",{"$f":"SUM(K70:K73)","v":0}]
["Data Centres",null,null,null,null,null,null,null,0,""]
["Core Layers",null,null,null,null,null,null,null,0,""]
["Distribution Layers",null,null,null,null,null,null,null,0,""]
["Capital Spares",null,null,null,null,null,null,null,0,""]
[null,null,null,null,null,null,null,null,null,""]
["Community Assets",null,{"$f":"+C76+C99","v":0},558800,0,0,0,195583,195583,1,{"$f":"+K76+K99","v":0}]
["Community Facilities",null,{"$f":"SUM(C77:C98)","v":0},0,0,0,0,0,0,"",{"$f":"SUM(K77:K98)","v":0}]
["Halls",null,null,null,null,null,null,null,0,""]
["Centres",null,null,null,null,null,null,null,0,""]
["Crèches",null,null,null,null,null,null,null,0,""]
["Clinics/Care Centres",null,null,null,null,null,null,null,0,""]
["Fire/Ambulance Stations",null,null,null,null,null,null,null,0,""]
["Testing Stations",null,null,null,null,null,null,null,0,""]
["Museums",null,null,null,null,null,null,null,0,""]
["Galleries",null,null,null,null,null,null,null,0,""]
["Theatres",null,null,null,null,null,null,null,0,""]
["Libraries",null,null,null,null,null,null,null,0,""]
["Cemeteries/Crematoria",null,null,null,null,null,null,null,0,""]
["Police",null,null,null,null,null,null,null,0,""]
["Purls",null,null,null,null,null,null,null,0,""]
["Public Open Space",null,null,null,null,null,null,null,0,""]
["Nature Reserves",null,null,null,null,null,null,null,0,""]
["Public Ablution Facilities",null,null,null,null,null,null,null,0,""]
["Markets",null,null,null,null,null,null,null,0,""]
["Stalls",null,null,null,null,null,null,null,0,""]
["Abattoirs",null,null,null,null,null,null,null,0,""]
["Airports",null,null,null,null,null,null,null,0,""]
["Taxi Ranks/Bus Terminals",null,null,null,null,null,null,null,0,""]
["Capital Spares",null,null,null,null,null,null,null,0,""]
["Sport and Recreation Facilities",null,{"$f":"SUM(C100:C102)","v":0},558800,0,0,0,195583,195583,1,{"$f":"SUM(K100:K102)","v":0}]
["Indoor Facilities",null,null,null,null,null,null,null,0,""]
["Outdoor Facilities",null,0,558800,0,0,0,195583,{"$f":"H101-G101","v":195583},{"$f":"IF(I101=0,\"\",I101/H101)","v":1},0]
["Capital Spares",null,null,null,null,null,null,null,0,""]
["Heritage assets",null,{"$f":"SUM(C104:C108)","v":0},0,0,0,0,0,0,"",{"$f":"SUM(K104:K108)","v":0}]
["Monuments",null,null,null,null,null,null,null,0,""]
["Historic Buildings",null,null,null,null,null,null,null,0,""]
["Works of Art",null,null,null,null,null,null,null,0,""]
["Conservation Areas",null,null,null,null,null,null,null,0,""]
["Other Heritage",null,null,null,null,null,null,null,0,""]
[null,null,null,null,null,null,null,null,0,""]
["Investment properties",null,{"$f":"+C111+C114","v":0},0,0,0,0,0,0,"",{"$f":"+K111+K114","v":0}]
["Revenue Generating",null,{"$f":"SUM(C112:C113)","v":0},0,0,0,0,0,0,"",{"$f":"SUM(K112:K113)","v":0}]
["Improved Property",null,null,null,null,null,null,null,0,""]
["Unimproved Property",null,null,null,null,null,null,null,0,""]
["Non-revenue Generating",null,{"$f":"SUM(C115:C116)","v":0},0,0,0,0,0,0,"",{"$f":"SUM(K115:K116)","v":0}]
["Improved Property",null,null,null,null,null,null,null,0,""]
["Unimproved Property",null,null,null,null,null,null,null,{"$f":"H116-G116","v":0},{"$f":"IF(I116=0,\"\",I116/H116)","v":""}]
["Other assets",null,{"$f":"+C118+C130","v":0},0,0,0,0,0,0,"",{"$f":"+K118+K130","v":0}]
["Operational Buildings",null,{"$f":"SUM(C119:C129)","v":0},0,0,0,0,0,0,"",{"$f":"SUM(K119:K129)","v":0}]
["Municipal Offices",null,null,null,null,null,null,null,0,""]
["Pay/Enquiry Points",null,null,null,null,null,null,null,0,""]
["Building Plan Offices",null,null,null,null,null,null,null,0,""]
["Workshops",null,null,null,null,null,null,null,0,""]
["Yards",null,null,null,null,null,null,null,0,""]
["Stores",null,null,null,null,null,null,null,0,""]
["Laboratories",null,null,null,null,null,null,null,0,""]
["Training Centres",null,null,null,null,null,null,null,0,""]
["Manufacturing Plant",null,null,null,null,null,null,null,0,""]
["Depots",null,null,null,null,null,null,null,0,""]
["Capital Spares",null,null,null,null,null,null,null,0,""]
["Housing",null,{"$f":"SUM(C131:C133)","v":0},0,0,0,0,0,0,"",{"$f":"SUM(K131:K133)","v":0}]
["Staff Housing",null,null,null,null,null,null,null,0,""]
["Social Housing",null,null,null,null,null,null,null,0,""]
["Capital Spares",null,null,null,null,null,null,null,0,""]
[null,null,null,null,null,null,null,null,null,""]
["Biological or Cultivated Assets",null,{"$f":"SUM(C136:C136)","v":0},0,0,0,0,0,{"$f":"H135-G135","v":0},"",{"$f":"SUM(K136)","v":0}]
["Biological or Cultivated Assets",null,null,null,null,null,null,null,{"$f":"H136-G136","v":0},""]
[null,null,null,null,null,null,null,null,null,{"$f":"IF(I137=0,\"\",I137/H137)","v":""}]
["Intangible Assets",null,{"$f":"SUM(C139:C140)","v":0},0,0,0,0,0,{"$f":"H138-G138","v":0},"",{"$f":"SUM(K139:K140)","v":0}]
["Servitudes",null,null,null,null,null,null,null,0,""]
["Licences and Rights",null,{"$f":"SUM(C141:C146)","v":0},0,0,0,0,0,0,"",{"$f":"SUM(K141:K146)","v":0}]
["Water Rights",null,null,null,null,null,null,null,0,""]
["Effluent Licenses",null,null,null,null,null,null,null,0,""]
["Solid Waste Licenses",null,null,null,null,null,null,null,0,""]
["Computer Software and Applications",null,null,null,null,null,null,null,0,""]
["Load Settlement Software Applications",null,null,null,null,null,null,null,0,""]
["Unspecified",null,null,null,null,null,null,null,0,""]
[]
["Computer Equipment",null,{"$f":"SUM(C149:C149)","v":0},0,0,0,0,0,{"$f":"H148-G148","v":0},{"$f":"IF(I148=0,\"\",I148/H148)","v":""},{"$f":"SUM(K149)","v":0}]
["Computer Equipment",null,null,null,null,null,null,null,{"$f":"H149-G149","v":0},{"$f":"IF(I149=0,\"\",I149/H149)","v":""}]
[]
["Furniture and Office Equipment",null,{"$f":"SUM(C152:C152)","v":0},0,0,0,0,0,{"$f":"H151-G151","v":0},{"$f":"IF(I151=0,\"\",I151/H151)","v":""},{"$f":"SUM(K152)","v":0}]
["Furniture and Office Equipment",null,null,null,null,null,null,null,{"$f":"H152-G152","v":0},{"$f":"IF(I152=0,\"\",I152/H152)","v":""}]
[null,null,null,null,null,null,null,null,null,{"$f":"IF(I153=0,\"\",I153/H153)","v":""}]
["Machinery and Equipment",null,{"$f":"SUM(C155:C155)","v":21200},0,60000,0,0,24000,{"$f":"H154-G154","v":24000},{"$f":"IF(I154=0,\"\",I154/H154)","v":1},{"$f":"SUM(K155)","v":60000}]
["Machinery and Equipment",null,21200,0,60000,0,0,24000,{"$f":"H155-G155","v":24000},{"$f":"IF(I155=0,\"\",I155/H155)","v":1},60000]
[]
["Transport Assets",null,{"$f":"SUM(C158:C158)","v":0},0,0,0,0,0,{"$f":"H157-G157","v":0},{"$f":"IF(I157=0,\"\",I157/H157)","v":""},{"$f":"SUM(K158)","v":0}]
["Transport Assets",null,null,null,null,null,null,null,{"$f":"H158-G158","v":0},{"$f":"IF(I158=0,\"\",I158/H158)","v":""}]
[]
["Land",null,{"$f":"SUM(C161:C161)","v":0},0,0,0,0,0,{"$f":"H160-G160","v":0},{"$f":"IF(I160=0,\"\",I160/H160)","v":""},{"$f":"SUM(K161)","v":0}]
["Land",null,null,null,null,null,null,null,{"$f":"H161-G161","v":0},{"$f":"IF(I161=0,\"\",I161/H161)","v":""}]
[null,null,null,null,null,null,null,null,null,"."]
["Zoo's, Marine and Non-biological Animals",null,{"$f":"SUM(C164:C164)","v":0},0,0,0,0,0,{"$f":"H163-G163","v":0},{"$f":"IF(I163=0,\"\",I163/H163)","v":""},{"$f":"SUM(K164)","v":0}]
["Zoo's, Marine and Non-biological Animals",null,null,null,null,null,null,null,{"$f":"H164-G164","v":0},""]
[null,null,null,null,null,null,null,null,null,""]
["Living resources",null,{"$f":"+C167+C170","v":0},0,0,0,0,0,{"$f":"H166-G166","v":0},"",{"$f":"+K167+K170","v":0}]
["Mature",null,{"$f":"+C168+C169","v":0},0,0,0,0,0,0,"",{"$f":"+K168+K169","v":0}]
["Policing and Protection",null,null,null,null,null,null,null,0,""]
["Zoological plants and animals",null,null,null,null,null,null,null,0,""]
["Immature",null,{"$f":"+C171+C172","v":0},{"$f":"+D171+D172","v":0},0,0,0,0,0,"",{"$f":"+K171+K172","v":0}]
["Policing and Protection",null,null,null,null,null,null,null,0,""]
["Zoological plants and animals",null,null,null,null,null,null,null,0,""]
["Total Capital Expenditure on upgrading of existing assets ",1,{"$f":"C7+C75+C103+C110+C117+C135+C138+C148+C151+C154+C157+C160+C163+C166","v":1484570.5},558800,60000,0,0,219583,{"$f":"H173-G173","v":219583},{"$f":"IF(I173=0,\"\",I173/H173)","v":1},{"$f":"K7+K75+K103+K110+K117+K135+K138+K148+K151+K154+K157+K160+K163+K166","v":60000}]
[]
[{"$f":"head27a","v":"References"}]
["1. Total Capital Expenditure on new assets (SC13a) plus Total Capital Expenditure on renewal of existing assets (SC13b) plus Total Capital Expenditure on upgrading of existing assets (SC13e)  must reconcile to total capital expenditure in Table C5"]

{"sheet":"SC71charts","index":33,"n_rows":104,"n_cols":10,"rows_kept":104,"cut":false,"hidden":false,"merged":[]}
[{"$f":"'Template names'!B102","v":"Chart C1 2025/26 Capital Expenditure Monthly Trend: actual v target"}]
["Month",{"$f":"'SC12'!B2","v":"2024/25"},{"$f":"'SC12'!C3","v":"Original Budget"},{"$f":"'SC12'!D3","v":"Adjusted Budget"},{"$f":"'SC12'!E3","v":"Monthly actual"}]
[{"$f":"LEFT('SC12'!A6,3)","v":"Jul"},{"$f":"'SC12'!B6","v":0},{"$f":"'SC12'!C6","v":5366405},{"$f":"'SC12'!D6","v":5366405},{"$f":"'SC12'!E6","v":2763197.56}]
[{"$f":"LEFT('SC12'!A7,3)","v":"Aug"},{"$f":"'SC12'!B7","v":1448489.35},{"$f":"'SC12'!C7","v":5366405},{"$f":"'SC12'!D7","v":5366405},{"$f":"'SC12'!E7","v":1954327.73}]
[{"$f":"LEFT('SC12'!A8,3)","v":"Sep"},{"$f":"'SC12'!B8","v":2352886.2999999998},{"$f":"'SC12'!C8","v":5366405},{"$f":"'SC12'!D8","v":5366405},{"$f":"'SC12'!E8","v":2016665.24}]
[{"$f":"LEFT('SC12'!A9,3)","v":"Oct"},{"$f":"'SC12'!B9","v":3737538.1},{"$f":"'SC12'!C9","v":5366405},{"$f":"'SC12'!D9","v":5366405},{"$f":"'SC12'!E9","v":3591990.8}]
[{"$f":"LEFT('SC12'!A10,3)","v":"Nov"},{"$f":"'SC12'!B10","v":5391676.1500000004},{"$f":"'SC12'!C10","v":5366405},{"$f":"'SC12'!D10","v":5366405},{"$f":"'SC12'!E10","v":3843230.48}]
[{"$f":"LEFT('SC12'!A11,3)","v":"Dec"},{"$f":"'SC12'!B11","v":14131727.09},{"$f":"'SC12'!C11","v":5366405},{"$f":"'SC12'!D11","v":5366405},{"$f":"'SC12'!E11","v":4433521.51}]
[{"$f":"LEFT('SC12'!A12,3)","v":"Jan"},{"$f":"'SC12'!B12","v":2785465.22},{"$f":"'SC12'!C12","v":5366405},{"$f":"'SC12'!D12","v":5366405},{"$f":"'SC12'!E12","v":1594282.5}]
[{"$f":"LEFT('SC12'!A13,3)","v":"Feb"},{"$f":"'SC12'!B13","v":6699599.0300000003},{"$f":"'SC12'!C13","v":4142445},{"$f":"'SC12'!D13","v":4142445},{"$f":"'SC12'!E13","v":513610}]
[{"$f":"LEFT('SC12'!A14,3)","v":"Mar"},{"$f":"'SC12'!B14","v":948191.1},{"$f":"'SC12'!C14","v":4142445},{"$f":"'SC12'!D14","v":4142445},{"$f":"'SC12'!E14","v":14105735.5}]
[{"$f":"LEFT('SC12'!A15,3)","v":"Apr"},{"$f":"'SC12'!B15","v":7053021.5800000001},{"$f":"'SC12'!C15","v":4142445},{"$f":"'SC12'!D15","v":4142445},{"$f":"'SC12'!E15","v":0}]
[{"$f":"LEFT('SC12'!A16,3)","v":"May"},{"$f":"'SC12'!B16","v":3110574},{"$f":"'SC12'!C16","v":4142445},{"$f":"'SC12'!D16","v":4142445},{"$f":"'SC12'!E16","v":0}]
[{"$f":"LEFT('SC12'!A17,3)","v":"Jun"},{"$f":"'SC12'!B17","v":4024671.57},{"$f":"'SC12'!C17","v":4142385},{"$f":"'SC12'!D17","v":4142385},{"$f":"'SC12'!E17","v":0}]
[]
[]
[]
[]
[]
[]
[]
[]
[]
[]
[]
[{"$f":"'Template names'!B103","v":"Chart C2 2025/26 Capital Expenditure: YTD actual v YTD target"}]
["Month",{"$f":"'SC12'!F3","v":"YearTD actual"},{"$f":"'SC12'!G3","v":"YearTD budget"}]
[{"$f":"LEFT('SC12'!A6,3)","v":"Jul"},{"$f":"'SC12'!F6","v":2763197.56},{"$f":"'SC12'!G6","v":5366405}]
[{"$f":"LEFT('SC12'!A7,3)","v":"Aug"},{"$f":"'SC12'!F7","v":1954327.73},{"$f":"'SC12'!G7","v":10732810}]
[{"$f":"LEFT('SC12'!A8,3)","v":"Sep"},{"$f":"'SC12'!F8","v":2016665.24},{"$f":"'SC12'!G8","v":16099215}]
[{"$f":"LEFT('SC12'!A9,3)","v":"Oct"},{"$f":"'SC12'!F9","v":3591990.8},{"$f":"'SC12'!G9","v":21465620}]
[{"$f":"LEFT('SC12'!A10,3)","v":"Nov"},{"$f":"'SC12'!F10","v":3843230.48},{"$f":"'SC12'!G10","v":26832025}]
[{"$f":"LEFT('SC12'!A11,3)","v":"Dec"},{"$f":"'SC12'!F11","v":4433521.51},{"$f":"'SC12'!G11","v":32198430}]
[{"$f":"LEFT('SC12'!A12,3)","v":"Jan"},{"$f":"'SC12'!F12","v":1594282.5},{"$f":"'SC12'!G12","v":37564835}]
[{"$f":"LEFT('SC12'!A13,3)","v":"Feb"},{"$f":"'SC12'!F13","v":513610},{"$f":"'SC12'!G13","v":41707280}]
[{"$f":"LEFT('SC12'!A14,3)","v":"Mar"},{"$f":"'SC12'!F14","v":14105735.5},{"$f":"'SC12'!G14","v":45849725}]
[{"$f":"LEFT('SC12'!A15,3)","v":"Apr"},{"$f":"'SC12'!F15","v":0},{"$f":"'SC12'!G15","v":49992170}]
[{"$f":"LEFT('SC12'!A16,3)","v":"May"},{"$f":"'SC12'!F16","v":0},{"$f":"'SC12'!G16","v":54134615}]
[{"$f":"LEFT('SC12'!A17,3)","v":"Jun"},{"$f":"'SC12'!F17","v":0},{"$f":"'SC12'!G17","v":58277000}]
[]
[]
[]
[]
[]
[]
[]
[]
[]
[]
[]
[{"$f":"'Template names'!B104","v":"Chart C3 Aged Consumer Debtors Analysis"}]
[null,{"$f":"'SC3'!C3","v":"0-30 Days"},{"$f":"'SC3'!D3","v":"31-60 Days"},{"$f":"'SC3'!E3","v":"61-90 Days"},{"$f":"'SC3'!F3","v":"91-120 Days"},{"$f":"'SC3'!G3","v":"121-150 Dys"},{"$f":"'SC3'!H3","v":"151-180 Dys"},{"$f":"'SC3'!I3","v":"181 Dys-1 Yr"},{"$f":"'SC3'!J3","v":"Over 1Yr"}]
[{"$f":"Head2","v":"Budget Year 2025/26"},{"$f":"'SC3'!C14","v":6064230},{"$f":"'SC3'!D14","v":8527872},{"$f":"'SC3'!E14","v":685388},{"$f":"'SC3'!F14","v":154330577},{"$f":"'SC3'!G14","v":0},{"$f":"'SC3'!H14","v":0},{"$f":"'SC3'!I14","v":0},{"$f":"'SC3'!J14","v":0}]
[{"$f":"Head1","v":"2024/25"},{"$f":"'SC3'!C15","v":913448},{"$f":"'SC3'!D15","v":3935239},{"$f":"'SC3'!E15","v":876807},{"$f":"'SC3'!F15","v":159302832},{"$f":"'SC3'!G15","v":0},{"$f":"'SC3'!H15","v":0},{"$f":"'SC3'!I15","v":0},{"$f":"'SC3'!J15","v":0}]
[]
[]
[]
[]
[]
[]
[]
[]
[]
[]
[]
[]
[]
[]
[]
[]
[]
[]
[]
[]
[]
[{"$f":"'Template names'!B105","v":"Chart C4 Consumer Debtors (total by Debtor Customer Category)"}]
[null,{"$f":"Head1","v":"2024/25"},{"$f":"Head2","v":"Budget Year 2025/26"}]
[{"$f":"'SC3'!A17","v":"Organs of State"},{"$f":"C78*0.97","v":39959840.640000001},{"$f":"'SC3'!K17","v":41195712}]
[{"$f":"'SC3'!A18","v":"Commercial"},{"$f":"C79*0.97","v":9451933.1699999999},{"$f":"'SC3'!K18","v":9744261}]
[{"$f":"'SC3'!A19","v":"Households"},{"$f":"C80*0.97","v":43176140.449999996},{"$f":"'SC3'!K19","v":44511485}]
[{"$f":"'SC3'!A20","v":"Other"},{"$f":"C81*0.97","v":71931910.730000004},{"$f":"'SC3'!K20","v":74156609}]
[]
[]
[]
[]
[]
[]
[]
[]
[]
[]
[]
[]
[]
[]
[]
[]
[]
[]
[]
[{"$f":"'Template names'!B106","v":"Chart C5 Aged Creditors Analysis"}]
[null,{"$f":"'SC4'!A6","v":"Bulk Electricity"},{"$f":"'SC4'!A7","v":"Bulk Water"},{"$f":"'SC4'!A8","v":"PAYE deductions"},{"$f":"'SC4'!A9","v":"VAT (output less input)"},{"$f":"'SC4'!A10","v":"Pensions / Retirement deductions"},{"$f":"'SC4'!A11","v":"Loan repayments"},{"$f":"'SC4'!A12","v":"Trade Creditors"},{"$f":"'SC4'!A13","v":"Auditor General"},{"$f":"'SC4'!A14","v":"Other"}]
[{"$f":"A54","v":"2024/25"},{"$f":"'SC4'!L6","v":0},{"$f":"'SC4'!L7","v":0},{"$f":"'SC4'!L8","v":0},{"$f":"'SC4'!L9","v":0},{"$f":"'SC4'!L10","v":0},{"$f":"'SC4'!L11","v":0},{"$f":"'SC4'!L12","v":0},{"$f":"'SC4'!L13","v":0},{"$f":"'SC4'!L14","v":0}]
[{"$f":"A53","v":"Budget Year 2025/26"},{"$f":"'SC4'!K6","v":0},{"$f":"'SC4'!K7","v":0},{"$f":"'SC4'!K8","v":0},{"$f":"'SC4'!K9","v":0},{"$f":"'SC4'!K10","v":0},{"$f":"'SC4'!K11","v":0},{"$f":"'SC4'!K12","v":0},{"$f":"'SC4'!K13","v":0},{"$f":"'SC4'!K14","v":73050}]